Home
last modified time | relevance | path

Searched refs:print_message (Results 1 – 1 of 1) sorted by relevance

/illumos-gate/usr/src/cmd/amt/
H A Damt.c81 static void print_message(char *);
141 print_message(gettext("TEST 1 FAILED\n")); in main()
145 print_message(gettext("FAIL: Logic error in test\n")); in main()
147 print_message(gettext("TEST 1 PASSED\n")); in main()
152 print_message(gettext("TEST 2 FAILED\n")); in main()
154 print_message(gettext("TEST 2 PASSED\n")); in main()
159 print_message(gettext("TEST 3 FAILED\n")); in main()
161 print_message(gettext("TEST 3 PASSED\n")); in main()
166 print_message(gettext("TEST 4 FAILED\n")); in main()
168 print_message(gettext("TEST 4 PASSED\n")); in main()
[all …]