| /freebsd/contrib/bmake/unit-tests/ |
| H A D | opt-debug-errors-jobs.exp | 4 *** Failed target: fail-spaces 6 *** Failed commands: 14 *** Failed target: fail-escaped-space 16 *** Failed commands: 26 *** Failed target: fail-newline 28 *** Failed commands: 38 *** Failed target: fail-multiline 40 *** Failed commands: 48 *** Failed target: fail-multiline-intention 50 *** Failed commands: [all …]
|
| H A D | opt-debug-errors.exp | 4 *** Failed target: fail-spaces 5 *** Failed command: echo '3 spaces'; false 10 *** Failed target: fail-escaped-space 11 *** Failed command: echo \ indented; false 18 *** Failed target: fail-newline 19 *** Failed command: echo 'line1 line2'; false 24 *** Failed target: fail-multiline 25 *** Failed command: echo 'line1 line2'; false 30 *** Failed target: fail-multiline-intention 31 *** Failed command: echo 'word1' 'word2'; false
|
| /freebsd/bin/sh/tests/builtins/ |
| H A D | case8.0 | 4 *) echo Failed at $LINENO ;; 8 [[:alpha:][:digit:]]) echo Failed at $LINENO ;; 10 *) echo Failed at $LINENO ;; 14 *[[:lower:]]*) echo Failed at $LINENO ;; 16 *) echo Failed at $LINENO ;; 20 [![:print:]]) echo Failed at $LINENO ;; 22 *) echo Failed at $LINENO ;; 27 [[:print:]]) echo Failed at $LINENO ;; 30 *) echo Failed at $LINENO ;;
|
| H A D | case13.0 | 4 *) echo Failed at $LINENO ;; 8 [\^^]) echo Failed at $LINENO ;; 10 *) echo Failed at $LINENO ;;
|
| H A D | case10.0 | 4 *) echo Failed at $LINENO ;; 9 *) echo Failed at $LINENO ;; 14 *) echo Failed at $LINENO ;;
|
| H A D | command6.0 | 4 echo "Failed: \$(command -pV ls) should not match */var/empty/ls*" ;; 7 echo "Failed: \$(command -pV ls) match \"ls is\"*\" \"/*/ls" ;;
|
| H A D | command7.0 | 6 echo "Failed: $*" 29 echo "Failed: \$(command -pv ls) match /*/ls"
|
| H A D | command11.0 | 6 echo "Failed: $*"
|
| /freebsd/contrib/googletest/googletest/test/ |
| H A D | googletest-output-test-golden-lin.txt | 121 Failed 134 Failed 139 Failed 146 Failed 209 Failed 216 Failed 224 Failed 233 Failed 245 Failed 252 Failed [all …]
|
| H A D | gtest-unittest-api_test.cc | 234 EXPECT_FALSE(unit_test->Failed()); in TearDown() 247 EXPECT_FALSE(test_suites[0]->Failed()); in TearDown() 266 EXPECT_FALSE(test_suites[2]->Failed()); in TearDown()
|
| /freebsd/crypto/heimdal/lib/hx509/ |
| H A D | hx509_err.et | 43 error_code FAILED_CREATE_SIGATURE, "Failed to create signature" 87 error_code PARSING_KEY_FAILED, "Failed to parse key" 90 error_code PARSING_NAME_FAILED, "Failed to parse name" 99 error_code OPEN_SESSION, "Failed to open session to slot" 100 error_code LOGIN, "Failed to login to slot" 101 error_code LOAD, "Failed to load PKCS module"
|
| /freebsd/contrib/llvm-project/clang/tools/driver/ |
| H A D | cc1as_main.cpp | 599 bool Failed = false; in ExecuteAssemblerImpl() local 608 Failed = Diags.Report(diag::err_target_unknown_triple) << Opts.Triple; in ExecuteAssemblerImpl() 621 if (!Failed) { in ExecuteAssemblerImpl() 623 Failed = Parser->Run(Opts.NoInitialTextSection); in ExecuteAssemblerImpl() 626 return Failed; in ExecuteAssemblerImpl() 631 bool Failed = ExecuteAssemblerImpl(Opts, Diags); in ExecuteAssembler() local 634 if (Failed) { in ExecuteAssembler() 641 return Failed; in ExecuteAssembler() 710 bool Failed = Diags.hasErrorOccurred() || ExecuteAssembler(Asm, Diags); in cc1as_main() local 717 return !!Failed; in cc1as_main()
|
| /freebsd/contrib/llvm-project/clang/lib/Sema/ |
| H A D | SemaOpenACCAtomic.cpp | 321 bool Failed = false; member 354 bool Failed = CheckOperandVariable( in CheckIncDec() local 361 return IDACInfo{Failed, IDACInfo::Unary, Inf.SubExpr}; in CheckIncDec() 511 bool Failed = CheckOperandVariable(BinInf->LHS, LPD) || in CheckIncDecAssignCompoundAssign() local 514 return IDACInfo{Failed, IDACInfo::CompoundAssign, BinInf->LHS}; in CheckIncDecAssignCompoundAssign() 573 .Failed) in CheckUpdate() 614 if (FirstExprResults.Failed) in CheckCapture() 660 if (SecondExprResults.Failed) in CheckCapture() 693 .Failed) in CheckCapture()
|
| /freebsd/contrib/llvm-project/clang/lib/APINotes/ |
| H A D | APINotesReader.cpp | 1850 llvm::VersionTuple SwiftVersion, bool &Failed) in APINotesReader() argument 1852 Failed = false; in APINotesReader() 1862 Failed = true; in APINotesReader() 1868 Failed = true; in APINotesReader() 1874 Failed = true; in APINotesReader() 1887 Failed = true; in APINotesReader() 1898 Failed = true; in APINotesReader() 1907 Failed = true; in APINotesReader() 1917 Failed = true; in APINotesReader() 1925 Failed = true; in APINotesReader() [all …]
|
| /freebsd/crypto/heimdal/lib/ntlm/ |
| H A D | ntlm_err.et | 10 error_code DECODE, "Failed to decode packet" 12 error_code CRYPTO, "Failed crypto primitive"
|
| /freebsd/contrib/llvm-project/llvm/lib/CodeGen/SelectionDAG/ |
| H A D | LegalizeTypes.cpp | 81 bool Failed = false; in PerformExpensiveChecks() local 136 Failed = true; in PerformExpensiveChecks() 141 Failed = true; in PerformExpensiveChecks() 153 Failed = true; in PerformExpensiveChecks() 157 Failed = true; in PerformExpensiveChecks() 161 if (Failed) { in PerformExpensiveChecks() 455 bool Failed = false; in run() local 463 Failed = true; in run() 472 Failed = true; in run() 484 Failed = true; in run() [all …]
|
| /freebsd/contrib/llvm-project/llvm/lib/Support/ |
| H A D | CrashRecoveryContext.cpp | 35 volatile unsigned Failed : 1; member 41 : CRC(CRC), Failed(false), SwitchedThread(false), ValidJumpBuffer(false) { in CrashRecoveryContextImpl() 67 assert(!Failed && "Crash recovery context already failed!"); in HandleCrash() 68 Failed = true; in HandleCrash()
|
| H A D | FormatVariadic.cpp | 53 bool Failed = Spec.consumeInteger(0, Align); in consumeFieldLayout() local 54 return !Failed; in consumeFieldLayout()
|
| /freebsd/lib/libfetch/ |
| H A D | http.errors | 33 412 SERVER Precondition Failed 38 417 SERVER Expectation Failed
|
| /freebsd/contrib/llvm-project/llvm/include/llvm/Testing/Support/ |
| H A D | Error.h | 195 MATCHER(Failed, "") { return !arg.Success(); } 198 testing::Matcher<const detail::ErrorHolder &> Failed() { in Failed() function 203 testing::Matcher<const detail::ErrorHolder &> Failed(M Matcher) { in Failed() function
|
| /freebsd/contrib/kyua/bootstrap/ |
| H A D | testsuite.at | 122 AT_CHECK([grep "atf_helpers:fails.*failed.*Failed on purpose" stdout], 161 AT_CHECK([grep "atf_helpers:fails.*failure.*Failed on purpose" stdout], 174 AT_CHECK([grep "atf_helpers:fails.*failure.*Failed on purpose" stdout], 194 AT_CHECK([grep "atf_helpers:fails.*failure.*Failed on purpose" stdout],
|
| /freebsd/crypto/heimdal/lib/krb5/ |
| H A D | heim_err.et | 13 error_code V4_PRINC_NO_CONV, "Failed to convert v4 principal" 18 error_code BAD_MKEY, "Failed to get the master key"
|
| /freebsd/contrib/llvm-project/clang/lib/CodeGen/ |
| H A D | ConstantEmitter.h | 38 bool Failed = false; variable 172 Failed = true; in markIfFailed()
|
| /freebsd/bin/sh/tests/parser/ |
| H A D | heredoc13.0 | 6 echo "Failed: $*"
|
| /freebsd/usr.sbin/bsdinstall/scripts/ |
| H A D | auto | 398 bsdinstall mount || error "Failed to mount filesystem" 402 bsdinstall mount || error "Failed to mount filesystem" 408 bsdinstall mount_aux || error "Failed to mount auxiliary filesystems"
|