xref: /freebsd/crypto/openssl/crypto/err/openssl.txt (revision 78e936b2d0b5e6554425009199be31e76bc67c10)
1# Copyright 1999-2026 The OpenSSL Project Authors. All Rights Reserved.
2#
3# Licensed under the Apache License 2.0 (the "License").  You may not use
4# this file except in compliance with the License.  You can obtain a copy
5# in the file LICENSE in the source distribution or at
6# https://www.openssl.org/source/license.html
7
8#Reason codes
9ASN1_R_ADDING_OBJECT:171:adding object
10ASN1_R_ASN1_PARSE_ERROR:203:asn1 parse error
11ASN1_R_ASN1_SIG_PARSE_ERROR:204:asn1 sig parse error
12ASN1_R_AUX_ERROR:100:aux error
13ASN1_R_BAD_OBJECT_HEADER:102:bad object header
14ASN1_R_BAD_TEMPLATE:230:bad template
15ASN1_R_BMPSTRING_IS_WRONG_LENGTH:214:bmpstring is wrong length
16ASN1_R_BN_LIB:105:bn lib
17ASN1_R_BOOLEAN_IS_WRONG_LENGTH:106:boolean is wrong length
18ASN1_R_BUFFER_TOO_SMALL:107:buffer too small
19ASN1_R_CIPHER_HAS_NO_OBJECT_IDENTIFIER:108:cipher has no object identifier
20ASN1_R_CONTEXT_NOT_INITIALISED:217:context not initialised
21ASN1_R_DATA_IS_WRONG:109:data is wrong
22ASN1_R_DECODE_ERROR:110:decode error
23ASN1_R_DEPTH_EXCEEDED:174:depth exceeded
24ASN1_R_DIGEST_AND_KEY_TYPE_NOT_SUPPORTED:198:digest and key type not supported
25ASN1_R_ENCODE_ERROR:112:encode error
26ASN1_R_ERROR_GETTING_TIME:173:error getting time
27ASN1_R_ERROR_LOADING_SECTION:172:error loading section
28ASN1_R_ERROR_SETTING_CIPHER_PARAMS:114:error setting cipher params
29ASN1_R_EXPECTING_AN_INTEGER:115:expecting an integer
30ASN1_R_EXPECTING_AN_OBJECT:116:expecting an object
31ASN1_R_EXPLICIT_LENGTH_MISMATCH:119:explicit length mismatch
32ASN1_R_EXPLICIT_TAG_NOT_CONSTRUCTED:120:explicit tag not constructed
33ASN1_R_FIELD_MISSING:121:field missing
34ASN1_R_FIRST_NUM_TOO_LARGE:122:first num too large
35ASN1_R_GENERALIZEDTIME_IS_TOO_SHORT:232:generalizedtime is too short
36ASN1_R_HEADER_TOO_LONG:123:header too long
37ASN1_R_ILLEGAL_BITSTRING_FORMAT:175:illegal bitstring format
38ASN1_R_ILLEGAL_BOOLEAN:176:illegal boolean
39ASN1_R_ILLEGAL_CHARACTERS:124:illegal characters
40ASN1_R_ILLEGAL_FORMAT:177:illegal format
41ASN1_R_ILLEGAL_HEX:178:illegal hex
42ASN1_R_ILLEGAL_IMPLICIT_TAG:179:illegal implicit tag
43ASN1_R_ILLEGAL_INTEGER:180:illegal integer
44ASN1_R_ILLEGAL_NEGATIVE_VALUE:226:illegal negative value
45ASN1_R_ILLEGAL_NESTED_TAGGING:181:illegal nested tagging
46ASN1_R_ILLEGAL_NULL:125:illegal null
47ASN1_R_ILLEGAL_NULL_VALUE:182:illegal null value
48ASN1_R_ILLEGAL_OBJECT:183:illegal object
49ASN1_R_ILLEGAL_OPTIONAL_ANY:126:illegal optional any
50ASN1_R_ILLEGAL_OPTIONS_ON_ITEM_TEMPLATE:170:illegal options on item template
51ASN1_R_ILLEGAL_PADDING:221:illegal padding
52ASN1_R_ILLEGAL_TAGGED_ANY:127:illegal tagged any
53ASN1_R_ILLEGAL_TIME_VALUE:184:illegal time value
54ASN1_R_ILLEGAL_ZERO_CONTENT:222:illegal zero content
55ASN1_R_INTEGER_NOT_ASCII_FORMAT:185:integer not ascii format
56ASN1_R_INTEGER_TOO_LARGE_FOR_LONG:128:integer too large for long
57ASN1_R_INVALID_BIT_STRING_BITS_LEFT:220:invalid bit string bits left
58ASN1_R_INVALID_BMPSTRING_LENGTH:129:invalid bmpstring length
59ASN1_R_INVALID_DIGIT:130:invalid digit
60ASN1_R_INVALID_MIME_TYPE:205:invalid mime type
61ASN1_R_INVALID_MODIFIER:186:invalid modifier
62ASN1_R_INVALID_NUMBER:187:invalid number
63ASN1_R_INVALID_OBJECT_ENCODING:216:invalid object encoding
64ASN1_R_INVALID_SCRYPT_PARAMETERS:227:invalid scrypt parameters
65ASN1_R_INVALID_SEPARATOR:131:invalid separator
66ASN1_R_INVALID_STRING_TABLE_VALUE:218:invalid string table value
67ASN1_R_INVALID_UNIVERSALSTRING_LENGTH:133:invalid universalstring length
68ASN1_R_INVALID_UTF8STRING:134:invalid utf8string
69ASN1_R_INVALID_VALUE:219:invalid value
70ASN1_R_LENGTH_TOO_LONG:231:length too long
71ASN1_R_LIST_ERROR:188:list error
72ASN1_R_MIME_NO_CONTENT_TYPE:206:mime no content type
73ASN1_R_MIME_PARSE_ERROR:207:mime parse error
74ASN1_R_MIME_SIG_PARSE_ERROR:208:mime sig parse error
75ASN1_R_MISSING_EOC:137:missing eoc
76ASN1_R_MISSING_SECOND_NUMBER:138:missing second number
77ASN1_R_MISSING_VALUE:189:missing value
78ASN1_R_MSTRING_NOT_UNIVERSAL:139:mstring not universal
79ASN1_R_MSTRING_WRONG_TAG:140:mstring wrong tag
80ASN1_R_NESTED_ASN1_STRING:197:nested asn1 string
81ASN1_R_NESTED_TOO_DEEP:201:nested too deep
82ASN1_R_NON_HEX_CHARACTERS:141:non hex characters
83ASN1_R_NOT_ASCII_FORMAT:190:not ascii format
84ASN1_R_NOT_ENOUGH_DATA:142:not enough data
85ASN1_R_NO_CONTENT_TYPE:209:no content type
86ASN1_R_NO_MATCHING_CHOICE_TYPE:143:no matching choice type
87ASN1_R_NO_MULTIPART_BODY_FAILURE:210:no multipart body failure
88ASN1_R_NO_MULTIPART_BOUNDARY:211:no multipart boundary
89ASN1_R_NO_SIG_CONTENT_TYPE:212:no sig content type
90ASN1_R_NULL_IS_WRONG_LENGTH:144:null is wrong length
91ASN1_R_OBJECT_NOT_ASCII_FORMAT:191:object not ascii format
92ASN1_R_ODD_NUMBER_OF_CHARS:145:odd number of chars
93ASN1_R_SECOND_NUMBER_TOO_LARGE:147:second number too large
94ASN1_R_SEQUENCE_LENGTH_MISMATCH:148:sequence length mismatch
95ASN1_R_SEQUENCE_NOT_CONSTRUCTED:149:sequence not constructed
96ASN1_R_SEQUENCE_OR_SET_NEEDS_CONFIG:192:sequence or set needs config
97ASN1_R_SHORT_LINE:150:short line
98ASN1_R_SIG_INVALID_MIME_TYPE:213:sig invalid mime type
99ASN1_R_STREAMING_NOT_SUPPORTED:202:streaming not supported
100ASN1_R_STRING_TOO_LONG:151:string too long
101ASN1_R_STRING_TOO_SHORT:152:string too short
102ASN1_R_THE_ASN1_OBJECT_IDENTIFIER_IS_NOT_KNOWN_FOR_THIS_MD:154:\
103	the asn1 object identifier is not known for this md
104ASN1_R_TIME_NOT_ASCII_FORMAT:193:time not ascii format
105ASN1_R_TOO_LARGE:223:too large
106ASN1_R_TOO_LONG:155:too long
107ASN1_R_TOO_SMALL:224:too small
108ASN1_R_TYPE_NOT_CONSTRUCTED:156:type not constructed
109ASN1_R_TYPE_NOT_PRIMITIVE:195:type not primitive
110ASN1_R_UNEXPECTED_EOC:159:unexpected eoc
111ASN1_R_UNIVERSALSTRING_IS_WRONG_LENGTH:215:universalstring is wrong length
112ASN1_R_UNKNOWN_DIGEST:229:unknown digest
113ASN1_R_UNKNOWN_FORMAT:160:unknown format
114ASN1_R_UNKNOWN_MESSAGE_DIGEST_ALGORITHM:161:unknown message digest algorithm
115ASN1_R_UNKNOWN_OBJECT_TYPE:162:unknown object type
116ASN1_R_UNKNOWN_PUBLIC_KEY_TYPE:163:unknown public key type
117ASN1_R_UNKNOWN_SIGNATURE_ALGORITHM:199:unknown signature algorithm
118ASN1_R_UNKNOWN_TAG:194:unknown tag
119ASN1_R_UNSUPPORTED_ANY_DEFINED_BY_TYPE:164:unsupported any defined by type
120ASN1_R_UNSUPPORTED_CIPHER:228:unsupported cipher
121ASN1_R_UNSUPPORTED_PUBLIC_KEY_TYPE:167:unsupported public key type
122ASN1_R_UNSUPPORTED_TYPE:196:unsupported type
123ASN1_R_UTCTIME_IS_TOO_SHORT:233:utctime is too short
124ASN1_R_WRONG_INTEGER_TYPE:225:wrong integer type
125ASN1_R_WRONG_PUBLIC_KEY_TYPE:200:wrong public key type
126ASN1_R_WRONG_TAG:168:wrong tag
127ASYNC_R_FAILED_TO_SET_POOL:101:failed to set pool
128ASYNC_R_FAILED_TO_SWAP_CONTEXT:102:failed to swap context
129ASYNC_R_INIT_FAILED:105:init failed
130ASYNC_R_INVALID_POOL_SIZE:103:invalid pool size
131BIO_R_ACCEPT_ERROR:100:accept error
132BIO_R_ADDRINFO_ADDR_IS_NOT_AF_INET:141:addrinfo addr is not af inet
133BIO_R_AMBIGUOUS_HOST_OR_SERVICE:129:ambiguous host or service
134BIO_R_BAD_FOPEN_MODE:101:bad fopen mode
135BIO_R_BROKEN_PIPE:124:broken pipe
136BIO_R_CONNECT_ERROR:103:connect error
137BIO_R_CONNECT_TIMEOUT:147:connect timeout
138BIO_R_GETHOSTBYNAME_ADDR_IS_NOT_AF_INET:107:gethostbyname addr is not af inet
139BIO_R_GETSOCKNAME_ERROR:132:getsockname error
140BIO_R_GETSOCKNAME_TRUNCATED_ADDRESS:133:getsockname truncated address
141BIO_R_GETTING_SOCKTYPE:134:getting socktype
142BIO_R_INVALID_ARGUMENT:125:invalid argument
143BIO_R_INVALID_SOCKET:135:invalid socket
144BIO_R_IN_USE:123:in use
145BIO_R_LENGTH_TOO_LONG:102:length too long
146BIO_R_LISTEN_V6_ONLY:136:listen v6 only
147BIO_R_LOCAL_ADDR_NOT_AVAILABLE:111:local addr not available
148BIO_R_LOOKUP_RETURNED_NOTHING:142:lookup returned nothing
149BIO_R_MALFORMED_HOST_OR_SERVICE:130:malformed host or service
150BIO_R_NBIO_CONNECT_ERROR:110:nbio connect error
151BIO_R_NON_FATAL:112:non fatal
152BIO_R_NO_ACCEPT_ADDR_OR_SERVICE_SPECIFIED:143:\
153	no accept addr or service specified
154BIO_R_NO_HOSTNAME_OR_SERVICE_SPECIFIED:144:no hostname or service specified
155BIO_R_NO_PORT_DEFINED:113:no port defined
156BIO_R_NO_SUCH_FILE:128:no such file
157BIO_R_PEER_ADDR_NOT_AVAILABLE:114:peer addr not available
158BIO_R_PORT_MISMATCH:150:port mismatch
159BIO_R_TFO_DISABLED:106:tfo disabled
160BIO_R_TFO_NO_KERNEL_SUPPORT:108:tfo no kernel support
161BIO_R_TRANSFER_ERROR:104:transfer error
162BIO_R_TRANSFER_TIMEOUT:105:transfer timeout
163BIO_R_UNABLE_TO_BIND_SOCKET:117:unable to bind socket
164BIO_R_UNABLE_TO_CREATE_SOCKET:118:unable to create socket
165BIO_R_UNABLE_TO_KEEPALIVE:137:unable to keepalive
166BIO_R_UNABLE_TO_LISTEN_SOCKET:119:unable to listen socket
167BIO_R_UNABLE_TO_NODELAY:138:unable to nodelay
168BIO_R_UNABLE_TO_REUSEADDR:139:unable to reuseaddr
169BIO_R_UNABLE_TO_TFO:109:unable to tfo
170BIO_R_UNAVAILABLE_IP_FAMILY:145:unavailable ip family
171BIO_R_UNINITIALIZED:120:uninitialized
172BIO_R_UNKNOWN_INFO_TYPE:140:unknown info type
173BIO_R_UNSUPPORTED_IP_FAMILY:146:unsupported ip family
174BIO_R_UNSUPPORTED_METHOD:121:unsupported method
175BIO_R_UNSUPPORTED_PROTOCOL_FAMILY:131:unsupported protocol family
176BIO_R_WRITE_TO_READ_ONLY_BIO:126:write to read only BIO
177BIO_R_WSASTARTUP:122:WSAStartup
178BN_R_ARG2_LT_ARG3:100:arg2 lt arg3
179BN_R_BAD_RECIPROCAL:101:bad reciprocal
180BN_R_BIGNUM_TOO_LONG:114:bignum too long
181BN_R_BITS_TOO_SMALL:118:bits too small
182BN_R_CALLED_WITH_EVEN_MODULUS:102:called with even modulus
183BN_R_DIV_BY_ZERO:103:div by zero
184BN_R_ENCODING_ERROR:104:encoding error
185BN_R_EXPAND_ON_STATIC_BIGNUM_DATA:105:expand on static bignum data
186BN_R_INPUT_NOT_REDUCED:110:input not reduced
187BN_R_INVALID_LENGTH:106:invalid length
188BN_R_INVALID_RANGE:115:invalid range
189BN_R_INVALID_SHIFT:119:invalid shift
190BN_R_NOT_A_SQUARE:111:not a square
191BN_R_NOT_INITIALIZED:107:not initialized
192BN_R_NO_INVERSE:108:no inverse
193BN_R_NO_PRIME_CANDIDATE:121:no prime candidate
194BN_R_NO_SOLUTION:116:no solution
195BN_R_NO_SUITABLE_DIGEST:120:no suitable digest
196BN_R_PRIVATE_KEY_TOO_LARGE:117:private key too large
197BN_R_P_IS_NOT_PRIME:112:p is not prime
198BN_R_TOO_MANY_ITERATIONS:113:too many iterations
199BN_R_TOO_MANY_TEMPORARY_VARIABLES:109:too many temporary variables
200CMP_R_ALGORITHM_NOT_SUPPORTED:139:algorithm not supported
201CMP_R_BAD_CHECKAFTER_IN_POLLREP:167:bad checkafter in pollrep
202CMP_R_BAD_REQUEST_ID:108:bad request id
203CMP_R_CERTHASH_UNMATCHED:156:certhash unmatched
204CMP_R_CERTID_NOT_FOUND:109:certid not found
205CMP_R_CERTIFICATE_NOT_ACCEPTED:169:certificate not accepted
206CMP_R_CERTIFICATE_NOT_FOUND:112:certificate not found
207CMP_R_CERTREQMSG_NOT_FOUND:157:certreqmsg not found
208CMP_R_CERTRESPONSE_NOT_FOUND:113:certresponse not found
209CMP_R_CERT_AND_KEY_DO_NOT_MATCH:114:cert and key do not match
210CMP_R_CHECKAFTER_OUT_OF_RANGE:181:checkafter out of range
211CMP_R_ENCOUNTERED_KEYUPDATEWARNING:176:encountered keyupdatewarning
212CMP_R_ENCOUNTERED_WAITING:162:encountered waiting
213CMP_R_ERROR_CALCULATING_PROTECTION:115:error calculating protection
214CMP_R_ERROR_CREATING_CERTCONF:116:error creating certconf
215CMP_R_ERROR_CREATING_CERTREP:117:error creating certrep
216CMP_R_ERROR_CREATING_CERTREQ:163:error creating certreq
217CMP_R_ERROR_CREATING_ERROR:118:error creating error
218CMP_R_ERROR_CREATING_GENM:119:error creating genm
219CMP_R_ERROR_CREATING_GENP:120:error creating genp
220CMP_R_ERROR_CREATING_PKICONF:122:error creating pkiconf
221CMP_R_ERROR_CREATING_POLLREP:123:error creating pollrep
222CMP_R_ERROR_CREATING_POLLREQ:124:error creating pollreq
223CMP_R_ERROR_CREATING_RP:125:error creating rp
224CMP_R_ERROR_CREATING_RR:126:error creating rr
225CMP_R_ERROR_PARSING_PKISTATUS:107:error parsing pkistatus
226CMP_R_ERROR_PROCESSING_MESSAGE:158:error processing message
227CMP_R_ERROR_PROTECTING_MESSAGE:127:error protecting message
228CMP_R_ERROR_SETTING_CERTHASH:128:error setting certhash
229CMP_R_ERROR_UNEXPECTED_CERTCONF:160:error unexpected certconf
230CMP_R_ERROR_VALIDATING_PROTECTION:140:error validating protection
231CMP_R_ERROR_VALIDATING_SIGNATURE:171:error validating signature
232CMP_R_EXPECTED_POLLREQ:104:expected pollreq
233CMP_R_FAILED_BUILDING_OWN_CHAIN:164:failed building own chain
234CMP_R_FAILED_EXTRACTING_CENTRAL_GEN_KEY:203:failed extracting central gen key
235CMP_R_FAILED_EXTRACTING_PUBKEY:141:failed extracting pubkey
236CMP_R_FAILURE_OBTAINING_RANDOM:110:failure obtaining random
237CMP_R_FAIL_INFO_OUT_OF_RANGE:129:fail info out of range
238CMP_R_GENERATE_CERTREQTEMPLATE:197:generate certreqtemplate
239CMP_R_GENERATE_CRLSTATUS:198:error creating crlstatus
240CMP_R_GETTING_GENP:192:getting genp
241CMP_R_GET_ITAV:199:get itav
242CMP_R_INVALID_ARGS:100:invalid args
243CMP_R_INVALID_GENP:193:invalid genp
244CMP_R_INVALID_KEYSPEC:202:invalid keyspec
245CMP_R_INVALID_OPTION:174:invalid option
246CMP_R_INVALID_ROOTCAKEYUPDATE:195:invalid rootcakeyupdate
247CMP_R_MISSING_CENTRAL_GEN_KEY:204:missing central gen key
248CMP_R_MISSING_CERTID:165:missing certid
249CMP_R_MISSING_KEY_INPUT_FOR_CREATING_PROTECTION:130:\
250	missing key input for creating protection
251CMP_R_MISSING_KEY_USAGE_DIGITALSIGNATURE:142:missing key usage digitalsignature
252CMP_R_MISSING_P10CSR:121:missing p10csr
253CMP_R_MISSING_PBM_SECRET:166:missing pbm secret
254CMP_R_MISSING_PRIVATE_KEY:131:missing private key
255CMP_R_MISSING_PRIVATE_KEY_FOR_POPO:190:missing private key for popo
256CMP_R_MISSING_PROTECTION:143:missing protection
257CMP_R_MISSING_PUBLIC_KEY:183:missing public key
258CMP_R_MISSING_REFERENCE_CERT:168:missing reference cert
259CMP_R_MISSING_SECRET:178:missing secret
260CMP_R_MISSING_SENDER_IDENTIFICATION:111:missing sender identification
261CMP_R_MISSING_TRUST_ANCHOR:179:missing trust anchor
262CMP_R_MISSING_TRUST_STORE:144:missing trust store
263CMP_R_MULTIPLE_REQUESTS_NOT_SUPPORTED:161:multiple requests not supported
264CMP_R_MULTIPLE_RESPONSES_NOT_SUPPORTED:170:multiple responses not supported
265CMP_R_MULTIPLE_SAN_SOURCES:102:multiple san sources
266CMP_R_NO_STDIO:194:no stdio
267CMP_R_NO_SUITABLE_SENDER_CERT:145:no suitable sender cert
268CMP_R_NULL_ARGUMENT:103:null argument
269CMP_R_PKIBODY_ERROR:146:pkibody error
270CMP_R_PKISTATUSINFO_NOT_FOUND:132:pkistatusinfo not found
271CMP_R_POLLING_FAILED:172:polling failed
272CMP_R_POTENTIALLY_INVALID_CERTIFICATE:147:potentially invalid certificate
273CMP_R_RECEIVED_ERROR:180:received error
274CMP_R_RECIPNONCE_UNMATCHED:148:recipnonce unmatched
275CMP_R_REQUEST_NOT_ACCEPTED:149:request not accepted
276CMP_R_REQUEST_REJECTED_BY_SERVER:182:request rejected by server
277CMP_R_SENDER_GENERALNAME_TYPE_NOT_SUPPORTED:150:\
278	sender generalname type not supported
279CMP_R_SRVCERT_DOES_NOT_VALIDATE_MSG:151:srvcert does not validate msg
280CMP_R_TOTAL_TIMEOUT:184:total timeout
281CMP_R_TRANSACTIONID_UNMATCHED:152:transactionid unmatched
282CMP_R_TRANSFER_ERROR:159:transfer error
283CMP_R_UNCLEAN_CTX:191:unclean ctx
284CMP_R_UNEXPECTED_CENTRAL_GEN_KEY:205:unexpected central gen key
285CMP_R_UNEXPECTED_CERTPROFILE:196:unexpected certprofile
286CMP_R_UNEXPECTED_CRLSTATUSLIST:201:unexpected crlstatuslist
287CMP_R_UNEXPECTED_PKIBODY:133:unexpected pkibody
288CMP_R_UNEXPECTED_PKISTATUS:185:unexpected pkistatus
289CMP_R_UNEXPECTED_POLLREQ:105:unexpected pollreq
290CMP_R_UNEXPECTED_PVNO:153:unexpected pvno
291CMP_R_UNEXPECTED_SENDER:106:unexpected sender
292CMP_R_UNKNOWN_ALGORITHM_ID:134:unknown algorithm id
293CMP_R_UNKNOWN_CERT_TYPE:135:unknown cert type
294CMP_R_UNKNOWN_CRL_ISSUER:200:unknown crl issuer
295CMP_R_UNKNOWN_PKISTATUS:186:unknown pkistatus
296CMP_R_UNSUPPORTED_ALGORITHM:136:unsupported algorithm
297CMP_R_UNSUPPORTED_KEY_TYPE:137:unsupported key type
298CMP_R_UNSUPPORTED_PKIBODY:101:unsupported pkibody
299CMP_R_UNSUPPORTED_PROTECTION_ALG_DHBASEDMAC:154:\
300	unsupported protection alg dhbasedmac
301CMP_R_VALUE_TOO_LARGE:175:value too large
302CMP_R_VALUE_TOO_SMALL:177:value too small
303CMP_R_WRONG_ALGORITHM_OID:138:wrong algorithm oid
304CMP_R_WRONG_CERTID:189:wrong certid
305CMP_R_WRONG_CERTID_IN_RP:187:wrong certid in rp
306CMP_R_WRONG_PBM_VALUE:155:wrong pbm value
307CMP_R_WRONG_RP_COMPONENT_COUNT:188:wrong rp component count
308CMP_R_WRONG_SERIAL_IN_RP:173:wrong serial in rp
309CMS_R_ADD_SIGNER_ERROR:99:add signer error
310CMS_R_ATTRIBUTE_ERROR:161:attribute error
311CMS_R_CERTIFICATE_ALREADY_PRESENT:175:certificate already present
312CMS_R_CERTIFICATE_HAS_NO_KEYID:160:certificate has no keyid
313CMS_R_CERTIFICATE_VERIFY_ERROR:100:certificate verify error
314CMS_R_CIPHER_AEAD_IN_ENVELOPED_DATA:200:cipher aead in enveloped data
315CMS_R_CIPHER_AEAD_SET_TAG_ERROR:184:cipher aead set tag error
316CMS_R_CIPHER_GET_TAG:185:cipher get tag
317CMS_R_CIPHER_INITIALISATION_ERROR:101:cipher initialisation error
318CMS_R_CIPHER_PARAMETER_INITIALISATION_ERROR:102:\
319	cipher parameter initialisation error
320CMS_R_CMS_DATAFINAL_ERROR:103:cms datafinal error
321CMS_R_CMS_LIB:104:cms lib
322CMS_R_CONTENTIDENTIFIER_MISMATCH:170:contentidentifier mismatch
323CMS_R_CONTENT_NOT_FOUND:105:content not found
324CMS_R_CONTENT_TYPE_MISMATCH:171:content type mismatch
325CMS_R_CONTENT_TYPE_NOT_COMPRESSED_DATA:106:content type not compressed data
326CMS_R_CONTENT_TYPE_NOT_ENVELOPED_DATA:107:content type not enveloped data
327CMS_R_CONTENT_TYPE_NOT_SIGNED_DATA:108:content type not signed data
328CMS_R_CONTENT_VERIFY_ERROR:109:content verify error
329CMS_R_CTRL_ERROR:110:ctrl error
330CMS_R_CTRL_FAILURE:111:ctrl failure
331CMS_R_DECODE_ERROR:187:decode error
332CMS_R_DECRYPT_ERROR:112:decrypt error
333CMS_R_ERROR_GETTING_PUBLIC_KEY:113:error getting public key
334CMS_R_ERROR_READING_MESSAGEDIGEST_ATTRIBUTE:114:\
335	error reading messagedigest attribute
336CMS_R_ERROR_SETTING_KEY:115:error setting key
337CMS_R_ERROR_SETTING_RECIPIENTINFO:116:error setting recipientinfo
338CMS_R_ERROR_UNSUPPORTED_STATIC_KEY_AGREEMENT:196:\
339	error unsupported static key agreement
340CMS_R_ESS_SIGNING_CERTID_MISMATCH_ERROR:183:ess signing certid mismatch error
341CMS_R_INVALID_ENCRYPTED_KEY_LENGTH:117:invalid encrypted key length
342CMS_R_INVALID_KEY_ENCRYPTION_PARAMETER:176:invalid key encryption parameter
343CMS_R_INVALID_KEY_LENGTH:118:invalid key length
344CMS_R_INVALID_LABEL:190:invalid label
345CMS_R_INVALID_OAEP_PARAMETERS:191:invalid oaep parameters
346CMS_R_KDF_PARAMETER_ERROR:186:kdf parameter error
347CMS_R_MD_BIO_INIT_ERROR:119:md bio init error
348CMS_R_MESSAGEDIGEST_ATTRIBUTE_WRONG_LENGTH:120:\
349	messagedigest attribute wrong length
350CMS_R_MESSAGEDIGEST_WRONG_LENGTH:121:messagedigest wrong length
351CMS_R_MSGSIGDIGEST_ERROR:172:msgsigdigest error
352CMS_R_MSGSIGDIGEST_VERIFICATION_FAILURE:162:msgsigdigest verification failure
353CMS_R_MSGSIGDIGEST_WRONG_LENGTH:163:msgsigdigest wrong length
354CMS_R_NEED_ONE_SIGNER:164:need one signer
355CMS_R_NOT_A_SIGNED_RECEIPT:165:not a signed receipt
356CMS_R_NOT_ENCRYPTED_DATA:122:not encrypted data
357CMS_R_NOT_KEK:123:not kek
358CMS_R_NOT_KEY_AGREEMENT:181:not key agreement
359CMS_R_NOT_KEY_TRANSPORT:124:not key transport
360CMS_R_NOT_PWRI:177:not pwri
361CMS_R_NOT_SUPPORTED_FOR_THIS_KEY_TYPE:125:not supported for this key type
362CMS_R_NO_CIPHER:126:no cipher
363CMS_R_NO_CONTENT:127:no content
364CMS_R_NO_CONTENT_TYPE:173:no content type
365CMS_R_NO_DEFAULT_DIGEST:128:no default digest
366CMS_R_NO_DIGEST_SET:129:no digest set
367CMS_R_NO_KEY:130:no key
368CMS_R_NO_KEY_OR_CERT:174:no key or cert
369CMS_R_NO_MATCHING_DIGEST:131:no matching digest
370CMS_R_NO_MATCHING_RECIPIENT:132:no matching recipient
371CMS_R_NO_MATCHING_SIGNATURE:166:no matching signature
372CMS_R_NO_MSGSIGDIGEST:167:no msgsigdigest
373CMS_R_NO_PASSWORD:178:no password
374CMS_R_NO_PRIVATE_KEY:133:no private key
375CMS_R_NO_PUBLIC_KEY:134:no public key
376CMS_R_NO_RECEIPT_REQUEST:168:no receipt request
377CMS_R_NO_SIGNERS:135:no signers
378CMS_R_OPERATION_UNSUPPORTED:182:operation unsupported
379CMS_R_PEER_KEY_ERROR:188:peer key error
380CMS_R_PRIVATE_KEY_DOES_NOT_MATCH_CERTIFICATE:136:\
381	private key does not match certificate
382CMS_R_RECEIPT_DECODE_ERROR:169:receipt decode error
383CMS_R_RECIPIENT_ERROR:137:recipient error
384CMS_R_SHARED_INFO_ERROR:189:shared info error
385CMS_R_SIGNER_CERTIFICATE_NOT_FOUND:138:signer certificate not found
386CMS_R_SIGNFINAL_ERROR:139:signfinal error
387CMS_R_SMIME_TEXT_ERROR:140:smime text error
388CMS_R_STORE_INIT_ERROR:141:store init error
389CMS_R_TYPE_NOT_COMPRESSED_DATA:142:type not compressed data
390CMS_R_TYPE_NOT_DATA:143:type not data
391CMS_R_TYPE_NOT_DIGESTED_DATA:144:type not digested data
392CMS_R_TYPE_NOT_ENCRYPTED_DATA:145:type not encrypted data
393CMS_R_TYPE_NOT_ENVELOPED_DATA:146:type not enveloped data
394CMS_R_UNABLE_TO_FINALIZE_CONTEXT:147:unable to finalize context
395CMS_R_UNKNOWN_CIPHER:148:unknown cipher
396CMS_R_UNKNOWN_DIGEST_ALGORITHM:149:unknown digest algorithm
397CMS_R_UNKNOWN_ID:150:unknown id
398CMS_R_UNSUPPORTED_COMPRESSION_ALGORITHM:151:unsupported compression algorithm
399CMS_R_UNSUPPORTED_CONTENT_ENCRYPTION_ALGORITHM:194:\
400	unsupported content encryption algorithm
401CMS_R_UNSUPPORTED_CONTENT_TYPE:152:unsupported content type
402CMS_R_UNSUPPORTED_ENCRYPTION_TYPE:192:unsupported encryption type
403CMS_R_UNSUPPORTED_KEK_ALGORITHM:153:unsupported kek algorithm
404CMS_R_UNSUPPORTED_KEY_ENCRYPTION_ALGORITHM:179:\
405	unsupported key encryption algorithm
406CMS_R_UNSUPPORTED_LABEL_SOURCE:193:unsupported label source
407CMS_R_UNSUPPORTED_RECIPIENTINFO_TYPE:155:unsupported recipientinfo type
408CMS_R_UNSUPPORTED_RECIPIENT_TYPE:154:unsupported recipient type
409CMS_R_UNSUPPORTED_SIGNATURE_ALGORITHM:195:unsupported signature algorithm
410CMS_R_UNSUPPORTED_TYPE:156:unsupported type
411CMS_R_UNWRAP_ERROR:157:unwrap error
412CMS_R_UNWRAP_FAILURE:180:unwrap failure
413CMS_R_VERIFICATION_FAILURE:158:verification failure
414CMS_R_WRAP_ERROR:159:wrap error
415COMP_R_BROTLI_DECODE_ERROR:102:brotli decode error
416COMP_R_BROTLI_ENCODE_ERROR:103:brotli encode error
417COMP_R_BROTLI_NOT_SUPPORTED:104:brotli not supported
418COMP_R_ZLIB_DEFLATE_ERROR:99:zlib deflate error
419COMP_R_ZLIB_INFLATE_ERROR:100:zlib inflate error
420COMP_R_ZLIB_NOT_SUPPORTED:101:zlib not supported
421COMP_R_ZSTD_COMPRESS_ERROR:105:zstd compress error
422COMP_R_ZSTD_DECODE_ERROR:106:zstd decode error
423COMP_R_ZSTD_DECOMPRESS_ERROR:107:zstd decompress error
424COMP_R_ZSTD_NOT_SUPPORTED:108:zstd not supported
425CONF_R_ERROR_LOADING_DSO:110:error loading dso
426CONF_R_INVALID_PRAGMA:122:invalid pragma
427CONF_R_LIST_CANNOT_BE_NULL:115:list cannot be null
428CONF_R_MANDATORY_BRACES_IN_VARIABLE_EXPANSION:123:\
429	mandatory braces in variable expansion
430CONF_R_MISSING_CLOSE_SQUARE_BRACKET:100:missing close square bracket
431CONF_R_MISSING_EQUAL_SIGN:101:missing equal sign
432CONF_R_MISSING_INIT_FUNCTION:112:missing init function
433CONF_R_MODULE_INITIALIZATION_ERROR:109:module initialization error
434CONF_R_NO_CLOSE_BRACE:102:no close brace
435CONF_R_NO_CONF:105:no conf
436CONF_R_NO_CONF_OR_ENVIRONMENT_VARIABLE:106:no conf or environment variable
437CONF_R_NO_SECTION:107:no section
438CONF_R_NO_SUCH_FILE:114:no such file
439CONF_R_NO_VALUE:108:no value
440CONF_R_NUMBER_TOO_LARGE:121:number too large
441CONF_R_OPENSSL_CONF_REFERENCES_MISSING_SECTION:124:\
442	openssl conf references missing section
443CONF_R_RECURSIVE_DIRECTORY_INCLUDE:111:recursive directory include
444CONF_R_RECURSIVE_SECTION_REFERENCE:126:recursive section reference
445CONF_R_RELATIVE_PATH:125:relative path
446CONF_R_SSL_COMMAND_SECTION_EMPTY:117:ssl command section empty
447CONF_R_SSL_COMMAND_SECTION_NOT_FOUND:118:ssl command section not found
448CONF_R_SSL_SECTION_EMPTY:119:ssl section empty
449CONF_R_SSL_SECTION_NOT_FOUND:120:ssl section not found
450CONF_R_UNABLE_TO_CREATE_NEW_SECTION:103:unable to create new section
451CONF_R_UNKNOWN_MODULE_NAME:113:unknown module name
452CONF_R_VARIABLE_EXPANSION_TOO_LONG:116:variable expansion too long
453CONF_R_VARIABLE_HAS_NO_VALUE:104:variable has no value
454CRMF_R_BAD_PBM_ITERATIONCOUNT:100:bad pbm iterationcount
455CRMF_R_CMS_NOT_SUPPORTED:122:cms not supported
456CRMF_R_CRMFERROR:102:crmferror
457CRMF_R_ERROR:103:error
458CRMF_R_ERROR_DECODING_CERTIFICATE:104:error decoding certificate
459CRMF_R_ERROR_DECODING_ENCRYPTEDKEY:123:error decoding encryptedkey
460CRMF_R_ERROR_DECRYPTING_CERTIFICATE:105:error decrypting certificate
461CRMF_R_ERROR_DECRYPTING_ENCRYPTEDKEY:124:error decrypting encryptedkey
462CRMF_R_ERROR_DECRYPTING_ENCRYPTEDVALUE:125:error decrypting encryptedvalue
463CRMF_R_ERROR_DECRYPTING_SYMMETRIC_KEY:106:error decrypting symmetric key
464CRMF_R_ERROR_SETTING_PURPOSE:126:error setting purpose
465CRMF_R_ERROR_VERIFYING_ENCRYPTEDKEY:127:error verifying encryptedkey
466CRMF_R_FAILURE_OBTAINING_RANDOM:107:failure obtaining random
467CRMF_R_ITERATIONCOUNT_BELOW_100:108:iterationcount below 100
468CRMF_R_MALFORMED_IV:101:malformed iv
469CRMF_R_NULL_ARGUMENT:109:null argument
470CRMF_R_POPOSKINPUT_NOT_SUPPORTED:113:poposkinput not supported
471CRMF_R_POPO_INCONSISTENT_CENTRAL_KEYGEN:128:popo inconsistent central keygen
472CRMF_R_POPO_INCONSISTENT_PUBLIC_KEY:117:popo inconsistent public key
473CRMF_R_POPO_MISSING:121:popo missing
474CRMF_R_POPO_MISSING_PUBLIC_KEY:118:popo missing public key
475CRMF_R_POPO_MISSING_SUBJECT:119:popo missing subject
476CRMF_R_POPO_RAVERIFIED_NOT_ACCEPTED:120:popo raverified not accepted
477CRMF_R_SETTING_MAC_ALGOR_FAILURE:110:setting mac algor failure
478CRMF_R_SETTING_OWF_ALGOR_FAILURE:111:setting owf algor failure
479CRMF_R_UNSUPPORTED_ALGORITHM:112:unsupported algorithm
480CRMF_R_UNSUPPORTED_CIPHER:114:unsupported cipher
481CRMF_R_UNSUPPORTED_METHOD_FOR_CREATING_POPO:115:\
482	unsupported method for creating popo
483CRMF_R_UNSUPPORTED_POPO_METHOD:116:unsupported popo method
484CRYPTO_R_BAD_ALGORITHM_NAME:117:bad algorithm name
485CRYPTO_R_CONFLICTING_NAMES:118:conflicting names
486CRYPTO_R_HEX_STRING_TOO_SHORT:121:hex string too short
487CRYPTO_R_ILLEGAL_HEX_DIGIT:102:illegal hex digit
488CRYPTO_R_INSUFFICIENT_DATA_SPACE:106:insufficient data space
489CRYPTO_R_INSUFFICIENT_PARAM_SIZE:107:insufficient param size
490CRYPTO_R_INSUFFICIENT_SECURE_DATA_SPACE:108:insufficient secure data space
491CRYPTO_R_INTEGER_OVERFLOW:127:integer overflow
492CRYPTO_R_INVALID_NEGATIVE_VALUE:122:invalid negative value
493CRYPTO_R_INVALID_NULL_ARGUMENT:109:invalid null argument
494CRYPTO_R_INVALID_OSSL_PARAM_TYPE:110:invalid ossl param type
495CRYPTO_R_NO_PARAMS_TO_MERGE:131:no params to merge
496CRYPTO_R_NO_SPACE_FOR_TERMINATING_NULL:128:no space for terminating null
497CRYPTO_R_ODD_NUMBER_OF_DIGITS:103:odd number of digits
498CRYPTO_R_PARAM_CANNOT_BE_REPRESENTED_EXACTLY:123:\
499	param cannot be represented exactly
500CRYPTO_R_PARAM_NOT_INTEGER_TYPE:124:param not integer type
501CRYPTO_R_PARAM_OF_INCOMPATIBLE_TYPE:129:param of incompatible type
502CRYPTO_R_PARAM_UNSIGNED_INTEGER_NEGATIVE_VALUE_UNSUPPORTED:125:\
503	param unsigned integer negative value unsupported
504CRYPTO_R_PARAM_UNSUPPORTED_FLOATING_POINT_FORMAT:130:\
505	param unsupported floating point format
506CRYPTO_R_PARAM_VALUE_TOO_LARGE_FOR_DESTINATION:126:\
507	param value too large for destination
508CRYPTO_R_PROVIDER_ALREADY_EXISTS:104:provider already exists
509CRYPTO_R_PROVIDER_SECTION_ERROR:105:provider section error
510CRYPTO_R_RANDOM_SECTION_ERROR:119:random section error
511CRYPTO_R_SECURE_MALLOC_FAILURE:111:secure malloc failure
512CRYPTO_R_STRING_TOO_LONG:112:string too long
513CRYPTO_R_TOO_MANY_BYTES:113:too many bytes
514CRYPTO_R_TOO_MANY_NAMES:132:too many names
515CRYPTO_R_TOO_MANY_RECORDS:114:too many records
516CRYPTO_R_TOO_SMALL_BUFFER:116:too small buffer
517CRYPTO_R_UNKNOWN_NAME_IN_RANDOM_SECTION:120:unknown name in random section
518CRYPTO_R_ZERO_LENGTH_NUMBER:115:zero length number
519CT_R_BASE64_DECODE_ERROR:108:base64 decode error
520CT_R_INVALID_LOG_ID_LENGTH:100:invalid log id length
521CT_R_LOG_CONF_INVALID:109:log conf invalid
522CT_R_LOG_CONF_INVALID_KEY:110:log conf invalid key
523CT_R_LOG_CONF_MISSING_DESCRIPTION:111:log conf missing description
524CT_R_LOG_CONF_MISSING_KEY:112:log conf missing key
525CT_R_LOG_KEY_INVALID:113:log key invalid
526CT_R_SCT_FUTURE_TIMESTAMP:116:sct future timestamp
527CT_R_SCT_INVALID:104:sct invalid
528CT_R_SCT_INVALID_SIGNATURE:107:sct invalid signature
529CT_R_SCT_LIST_INVALID:105:sct list invalid
530CT_R_SCT_LOG_ID_MISMATCH:114:sct log id mismatch
531CT_R_SCT_NOT_SET:106:sct not set
532CT_R_SCT_UNSUPPORTED_VERSION:115:sct unsupported version
533CT_R_UNRECOGNIZED_SIGNATURE_NID:101:unrecognized signature nid
534CT_R_UNSUPPORTED_ENTRY_TYPE:102:unsupported entry type
535CT_R_UNSUPPORTED_VERSION:103:unsupported version
536DH_R_BAD_FFC_PARAMETERS:127:bad ffc parameters
537DH_R_BAD_GENERATOR:101:bad generator
538DH_R_BN_DECODE_ERROR:109:bn decode error
539DH_R_BN_ERROR:106:bn error
540DH_R_CHECK_INVALID_J_VALUE:115:check invalid j value
541DH_R_CHECK_INVALID_Q_VALUE:116:check invalid q value
542DH_R_CHECK_PUBKEY_INVALID:122:check pubkey invalid
543DH_R_CHECK_PUBKEY_TOO_LARGE:123:check pubkey too large
544DH_R_CHECK_PUBKEY_TOO_SMALL:124:check pubkey too small
545DH_R_CHECK_P_NOT_PRIME:117:check p not prime
546DH_R_CHECK_P_NOT_SAFE_PRIME:118:check p not safe prime
547DH_R_CHECK_Q_NOT_PRIME:119:check q not prime
548DH_R_DECODE_ERROR:104:decode error
549DH_R_INVALID_PARAMETER_NAME:110:invalid parameter name
550DH_R_INVALID_PARAMETER_NID:114:invalid parameter nid
551DH_R_INVALID_PUBKEY:102:invalid public key
552DH_R_INVALID_SECRET:128:invalid secret
553DH_R_INVALID_SIZE:129:invalid size
554DH_R_KDF_PARAMETER_ERROR:112:kdf parameter error
555DH_R_KEYS_NOT_SET:108:keys not set
556DH_R_MISSING_PUBKEY:125:missing pubkey
557DH_R_MODULUS_TOO_LARGE:103:modulus too large
558DH_R_MODULUS_TOO_SMALL:126:modulus too small
559DH_R_NOT_SUITABLE_GENERATOR:120:not suitable generator
560DH_R_NO_PARAMETERS_SET:107:no parameters set
561DH_R_NO_PRIVATE_VALUE:100:no private value
562DH_R_PARAMETER_ENCODING_ERROR:105:parameter encoding error
563DH_R_PEER_KEY_ERROR:111:peer key error
564DH_R_Q_TOO_LARGE:130:q too large
565DH_R_SHARED_INFO_ERROR:113:shared info error
566DH_R_UNABLE_TO_CHECK_GENERATOR:121:unable to check generator
567DSA_R_BAD_FFC_PARAMETERS:114:bad ffc parameters
568DSA_R_BAD_Q_VALUE:102:bad q value
569DSA_R_BN_DECODE_ERROR:108:bn decode error
570DSA_R_BN_ERROR:109:bn error
571DSA_R_DECODE_ERROR:104:decode error
572DSA_R_INVALID_DIGEST_TYPE:106:invalid digest type
573DSA_R_INVALID_PARAMETERS:112:invalid parameters
574DSA_R_MISSING_PARAMETERS:101:missing parameters
575DSA_R_MISSING_PRIVATE_KEY:111:missing private key
576DSA_R_MODULUS_TOO_LARGE:103:modulus too large
577DSA_R_NO_PARAMETERS_SET:107:no parameters set
578DSA_R_PARAMETER_ENCODING_ERROR:105:parameter encoding error
579DSA_R_P_NOT_PRIME:115:p not prime
580DSA_R_Q_NOT_PRIME:113:q not prime
581DSA_R_SEED_LEN_SMALL:110:seed_len is less than the length of q
582DSA_R_TOO_MANY_RETRIES:116:too many retries
583DSO_R_CTRL_FAILED:100:control command failed
584DSO_R_DSO_ALREADY_LOADED:110:dso already loaded
585DSO_R_EMPTY_FILE_STRUCTURE:113:empty file structure
586DSO_R_FAILURE:114:failure
587DSO_R_FILENAME_TOO_BIG:101:filename too big
588DSO_R_FINISH_FAILED:102:cleanup method function failed
589DSO_R_INCORRECT_FILE_SYNTAX:115:incorrect file syntax
590DSO_R_LOAD_FAILED:103:could not load the shared library
591DSO_R_NAME_TRANSLATION_FAILED:109:name translation failed
592DSO_R_NO_FILENAME:111:no filename
593DSO_R_NULL_HANDLE:104:a null shared library handle was used
594DSO_R_SET_FILENAME_FAILED:112:set filename failed
595DSO_R_STACK_ERROR:105:the meth_data stack is corrupt
596DSO_R_SYM_FAILURE:106:could not bind to the requested symbol name
597DSO_R_UNLOAD_FAILED:107:could not unload the shared library
598DSO_R_UNSUPPORTED:108:functionality not supported
599EC_R_ASN1_ERROR:115:asn1 error
600EC_R_BAD_SIGNATURE:156:bad signature
601EC_R_BIGNUM_OUT_OF_RANGE:144:bignum out of range
602EC_R_BUFFER_TOO_SMALL:100:buffer too small
603EC_R_CANNOT_INVERT:165:cannot invert
604EC_R_COORDINATES_OUT_OF_RANGE:146:coordinates out of range
605EC_R_CURVE_DOES_NOT_SUPPORT_ECDH:160:curve does not support ecdh
606EC_R_CURVE_DOES_NOT_SUPPORT_ECDSA:170:curve does not support ecdsa
607EC_R_CURVE_DOES_NOT_SUPPORT_SIGNING:159:curve does not support signing
608EC_R_DECODE_ERROR:142:decode error
609EC_R_DISCRIMINANT_IS_ZERO:118:discriminant is zero
610EC_R_EC_GROUP_NEW_BY_NAME_FAILURE:119:ec group new by name failure
611EC_R_EXPLICIT_PARAMS_NOT_SUPPORTED:127:explicit params not supported
612EC_R_FAILED_MAKING_PUBLIC_KEY:166:failed making public key
613EC_R_FIELD_TOO_LARGE:143:field too large
614EC_R_GF2M_NOT_SUPPORTED:147:gf2m not supported
615EC_R_GROUP2PKPARAMETERS_FAILURE:120:group2pkparameters failure
616EC_R_I2D_ECPKPARAMETERS_FAILURE:121:i2d ecpkparameters failure
617EC_R_INCOMPATIBLE_OBJECTS:101:incompatible objects
618EC_R_INVALID_A:168:invalid a
619EC_R_INVALID_ARGUMENT:112:invalid argument
620EC_R_INVALID_B:169:invalid b
621EC_R_INVALID_COFACTOR:171:invalid cofactor
622EC_R_INVALID_COMPRESSED_POINT:110:invalid compressed point
623EC_R_INVALID_COMPRESSION_BIT:109:invalid compression bit
624EC_R_INVALID_CURVE:141:invalid curve
625EC_R_INVALID_DIGEST:151:invalid digest
626EC_R_INVALID_DIGEST_TYPE:138:invalid digest type
627EC_R_INVALID_ENCODING:102:invalid encoding
628EC_R_INVALID_FIELD:103:invalid field
629EC_R_INVALID_FORM:104:invalid form
630EC_R_INVALID_GENERATOR:173:invalid generator
631EC_R_INVALID_GROUP_ORDER:122:invalid group order
632EC_R_INVALID_KEY:116:invalid key
633EC_R_INVALID_LENGTH:117:invalid length
634EC_R_INVALID_NAMED_GROUP_CONVERSION:174:invalid named group conversion
635EC_R_INVALID_OUTPUT_LENGTH:161:invalid output length
636EC_R_INVALID_P:172:invalid p
637EC_R_INVALID_PEER_KEY:133:invalid peer key
638EC_R_INVALID_PENTANOMIAL_BASIS:132:invalid pentanomial basis
639EC_R_INVALID_PRIVATE_KEY:123:invalid private key
640EC_R_INVALID_SEED:175:invalid seed
641EC_R_INVALID_TRINOMIAL_BASIS:137:invalid trinomial basis
642EC_R_KDF_PARAMETER_ERROR:148:kdf parameter error
643EC_R_KEYS_NOT_SET:140:keys not set
644EC_R_LADDER_POST_FAILURE:136:ladder post failure
645EC_R_LADDER_PRE_FAILURE:153:ladder pre failure
646EC_R_LADDER_STEP_FAILURE:162:ladder step failure
647EC_R_MISSING_OID:167:missing OID
648EC_R_MISSING_PARAMETERS:124:missing parameters
649EC_R_MISSING_PRIVATE_KEY:125:missing private key
650EC_R_NEED_NEW_SETUP_VALUES:157:need new setup values
651EC_R_NOT_A_NIST_PRIME:135:not a NIST prime
652EC_R_NOT_IMPLEMENTED:126:not implemented
653EC_R_NOT_INITIALIZED:111:not initialized
654EC_R_NO_PARAMETERS_SET:139:no parameters set
655EC_R_NO_PRIVATE_VALUE:154:no private value
656EC_R_OPERATION_NOT_SUPPORTED:152:operation not supported
657EC_R_PASSED_NULL_PARAMETER:134:passed null parameter
658EC_R_PEER_KEY_ERROR:149:peer key error
659EC_R_POINT_ARITHMETIC_FAILURE:155:point arithmetic failure
660EC_R_POINT_AT_INFINITY:106:point at infinity
661EC_R_POINT_COORDINATES_BLIND_FAILURE:163:point coordinates blind failure
662EC_R_POINT_IS_NOT_ON_CURVE:107:point is not on curve
663EC_R_RANDOM_NUMBER_GENERATION_FAILED:158:random number generation failed
664EC_R_SHARED_INFO_ERROR:150:shared info error
665EC_R_SLOT_FULL:108:slot full
666EC_R_TOO_MANY_RETRIES:176:too many retries
667EC_R_UNDEFINED_GENERATOR:113:undefined generator
668EC_R_UNDEFINED_ORDER:128:undefined order
669EC_R_UNKNOWN_COFACTOR:164:unknown cofactor
670EC_R_UNKNOWN_GROUP:129:unknown group
671EC_R_UNKNOWN_ORDER:114:unknown order
672EC_R_UNSUPPORTED_FIELD:131:unsupported field
673EC_R_WRONG_CURVE_PARAMETERS:145:wrong curve parameters
674EC_R_WRONG_ORDER:130:wrong order
675ENGINE_R_ALREADY_LOADED:100:already loaded
676ENGINE_R_ARGUMENT_IS_NOT_A_NUMBER:133:argument is not a number
677ENGINE_R_CMD_NOT_EXECUTABLE:134:cmd not executable
678ENGINE_R_COMMAND_TAKES_INPUT:135:command takes input
679ENGINE_R_COMMAND_TAKES_NO_INPUT:136:command takes no input
680ENGINE_R_CONFLICTING_ENGINE_ID:103:conflicting engine id
681ENGINE_R_CTRL_COMMAND_NOT_IMPLEMENTED:119:ctrl command not implemented
682ENGINE_R_DSO_FAILURE:104:DSO failure
683ENGINE_R_DSO_NOT_FOUND:132:dso not found
684ENGINE_R_ENGINES_SECTION_ERROR:148:engines section error
685ENGINE_R_ENGINE_CONFIGURATION_ERROR:102:engine configuration error
686ENGINE_R_ENGINE_IS_NOT_IN_LIST:105:engine is not in the list
687ENGINE_R_ENGINE_SECTION_ERROR:149:engine section error
688ENGINE_R_FAILED_LOADING_PRIVATE_KEY:128:failed loading private key
689ENGINE_R_FAILED_LOADING_PUBLIC_KEY:129:failed loading public key
690ENGINE_R_FINISH_FAILED:106:finish failed
691ENGINE_R_ID_OR_NAME_MISSING:108:'id' or 'name' missing
692ENGINE_R_INIT_FAILED:109:init failed
693ENGINE_R_INTERNAL_LIST_ERROR:110:internal list error
694ENGINE_R_INVALID_ARGUMENT:143:invalid argument
695ENGINE_R_INVALID_CMD_NAME:137:invalid cmd name
696ENGINE_R_INVALID_CMD_NUMBER:138:invalid cmd number
697ENGINE_R_INVALID_INIT_VALUE:151:invalid init value
698ENGINE_R_INVALID_STRING:150:invalid string
699ENGINE_R_NOT_INITIALISED:117:not initialised
700ENGINE_R_NOT_LOADED:112:not loaded
701ENGINE_R_NO_CONTROL_FUNCTION:120:no control function
702ENGINE_R_NO_INDEX:144:no index
703ENGINE_R_NO_LOAD_FUNCTION:125:no load function
704ENGINE_R_NO_REFERENCE:130:no reference
705ENGINE_R_NO_SUCH_ENGINE:116:no such engine
706ENGINE_R_UNIMPLEMENTED_CIPHER:146:unimplemented cipher
707ENGINE_R_UNIMPLEMENTED_DIGEST:147:unimplemented digest
708ENGINE_R_UNIMPLEMENTED_PUBLIC_KEY_METHOD:101:unimplemented public key method
709ENGINE_R_VERSION_INCOMPATIBILITY:145:version incompatibility
710ESS_R_EMPTY_ESS_CERT_ID_LIST:107:empty ess cert id list
711ESS_R_ESS_CERT_DIGEST_ERROR:103:ess cert digest error
712ESS_R_ESS_CERT_ID_NOT_FOUND:104:ess cert id not found
713ESS_R_ESS_CERT_ID_WRONG_ORDER:105:ess cert id wrong order
714ESS_R_ESS_DIGEST_ALG_UNKNOWN:106:ess digest alg unknown
715ESS_R_ESS_SIGNING_CERTIFICATE_ERROR:102:ess signing certificate error
716ESS_R_ESS_SIGNING_CERT_ADD_ERROR:100:ess signing cert add error
717ESS_R_ESS_SIGNING_CERT_V2_ADD_ERROR:101:ess signing cert v2 add error
718ESS_R_MISSING_SIGNING_CERTIFICATE_ATTRIBUTE:108:\
719	missing signing certificate attribute
720EVP_R_AES_KEY_SETUP_FAILED:143:aes key setup failed
721EVP_R_ARIA_KEY_SETUP_FAILED:176:aria key setup failed
722EVP_R_BAD_ALGORITHM_NAME:200:bad algorithm name
723EVP_R_BAD_DECRYPT:100:bad decrypt
724EVP_R_BAD_KEY_LENGTH:195:bad key length
725EVP_R_BUFFER_TOO_SMALL:155:buffer too small
726EVP_R_CACHE_CONSTANTS_FAILED:225:cache constants failed
727EVP_R_CAMELLIA_KEY_SETUP_FAILED:157:camellia key setup failed
728EVP_R_CANNOT_GET_PARAMETERS:197:cannot get parameters
729EVP_R_CANNOT_SET_PARAMETERS:198:cannot set parameters
730EVP_R_CIPHER_NOT_GCM_MODE:184:cipher not gcm mode
731EVP_R_CIPHER_PARAMETER_ERROR:122:cipher parameter error
732EVP_R_COMMAND_NOT_SUPPORTED:147:command not supported
733EVP_R_CONFLICTING_ALGORITHM_NAME:201:conflicting algorithm name
734EVP_R_COPY_ERROR:173:copy error
735EVP_R_CTRL_NOT_IMPLEMENTED:132:ctrl not implemented
736EVP_R_CTRL_OPERATION_NOT_IMPLEMENTED:133:ctrl operation not implemented
737EVP_R_DATA_NOT_MULTIPLE_OF_BLOCK_LENGTH:138:data not multiple of block length
738EVP_R_DECODE_ERROR:114:decode error
739EVP_R_DEFAULT_QUERY_PARSE_ERROR:210:default query parse error
740EVP_R_DIFFERENT_KEY_TYPES:101:different key types
741EVP_R_DIFFERENT_PARAMETERS:153:different parameters
742EVP_R_ERROR_LOADING_SECTION:165:error loading section
743EVP_R_EXPECTING_AN_HMAC_KEY:174:expecting an hmac key
744EVP_R_EXPECTING_AN_RSA_KEY:127:expecting an rsa key
745EVP_R_EXPECTING_A_DH_KEY:128:expecting a dh key
746EVP_R_EXPECTING_A_DSA_KEY:129:expecting a dsa key
747EVP_R_EXPECTING_A_ECX_KEY:219:expecting an ecx key
748EVP_R_EXPECTING_A_EC_KEY:142:expecting an ec key
749EVP_R_EXPECTING_A_POLY1305_KEY:164:expecting a poly1305 key
750EVP_R_EXPECTING_A_SIPHASH_KEY:175:expecting a siphash key
751EVP_R_FINAL_ERROR:188:final error
752EVP_R_GENERATE_ERROR:214:generate error
753EVP_R_GETTING_ALGORITHMIDENTIFIER_NOT_SUPPORTED:229:\
754	getting AlgorithmIdentifier not supported
755EVP_R_GET_RAW_KEY_FAILED:182:get raw key failed
756EVP_R_ILLEGAL_SCRYPT_PARAMETERS:171:illegal scrypt parameters
757EVP_R_INACCESSIBLE_DOMAIN_PARAMETERS:204:inaccessible domain parameters
758EVP_R_INACCESSIBLE_KEY:203:inaccessible key
759EVP_R_INITIALIZATION_ERROR:134:initialization error
760EVP_R_INPUT_NOT_INITIALIZED:111:input not initialized
761EVP_R_INVALID_CUSTOM_LENGTH:185:invalid custom length
762EVP_R_INVALID_DIGEST:152:invalid digest
763EVP_R_INVALID_IV_LENGTH:194:invalid iv length
764EVP_R_INVALID_KEY:163:invalid key
765EVP_R_INVALID_KEY_LENGTH:130:invalid key length
766EVP_R_INVALID_LENGTH:221:invalid length
767EVP_R_INVALID_NULL_ALGORITHM:218:invalid null algorithm
768EVP_R_INVALID_OPERATION:148:invalid operation
769EVP_R_INVALID_PROVIDER_FUNCTIONS:193:invalid provider functions
770EVP_R_INVALID_SALT_LENGTH:186:invalid salt length
771EVP_R_INVALID_SECRET_LENGTH:223:invalid secret length
772EVP_R_INVALID_SEED_LENGTH:220:invalid seed length
773EVP_R_INVALID_VALUE:222:invalid value
774EVP_R_KEYMGMT_EXPORT_FAILURE:205:keymgmt export failure
775EVP_R_KEY_SETUP_FAILED:180:key setup failed
776EVP_R_LOCKING_NOT_SUPPORTED:213:locking not supported
777EVP_R_MEMORY_LIMIT_EXCEEDED:172:memory limit exceeded
778EVP_R_MESSAGE_DIGEST_IS_NULL:159:message digest is null
779EVP_R_METHOD_NOT_SUPPORTED:144:method not supported
780EVP_R_MISSING_PARAMETERS:103:missing parameters
781EVP_R_NOT_ABLE_TO_COPY_CTX:190:not able to copy ctx
782EVP_R_NOT_XOF_OR_INVALID_LENGTH:178:not XOF or invalid length
783EVP_R_NO_CIPHER_SET:131:no cipher set
784EVP_R_NO_DEFAULT_DIGEST:158:no default digest
785EVP_R_NO_DIGEST_SET:139:no digest set
786EVP_R_NO_IMPORT_FUNCTION:206:no import function
787EVP_R_NO_KEYMGMT_AVAILABLE:199:no keymgmt available
788EVP_R_NO_KEYMGMT_PRESENT:196:no keymgmt present
789EVP_R_NO_KEY_SET:154:no key set
790EVP_R_NO_OPERATION_SET:149:no operation set
791EVP_R_NULL_MAC_PKEY_CTX:208:null mac pkey ctx
792EVP_R_ONLY_ONESHOT_SUPPORTED:177:only oneshot supported
793EVP_R_OPERATION_NOT_INITIALIZED:151:operation not initialized
794EVP_R_OPERATION_NOT_SUPPORTED_FOR_THIS_KEYTYPE:150:\
795	operation not supported for this keytype
796EVP_R_OPERATION_NOT_SUPPORTED_FOR_THIS_SIGNATURE_TYPE:226:\
797	operation not supported for this signature type
798EVP_R_OUTPUT_WOULD_OVERFLOW:202:output would overflow
799EVP_R_PARAMETER_TOO_LARGE:187:parameter too large
800EVP_R_PARTIALLY_OVERLAPPING:162:partially overlapping buffers
801EVP_R_PBKDF2_ERROR:181:pbkdf2 error
802EVP_R_PIPELINE_NOT_SUPPORTED:230:pipeline not supported
803EVP_R_PKEY_APPLICATION_ASN1_METHOD_ALREADY_REGISTERED:179:\
804	pkey application asn1 method already registered
805EVP_R_PRIVATE_KEY_DECODE_ERROR:145:private key decode error
806EVP_R_PRIVATE_KEY_ENCODE_ERROR:146:private key encode error
807EVP_R_PROVIDER_ASYM_CIPHER_FAILURE:232:provider asym cipher failure
808EVP_R_PROVIDER_ASYM_CIPHER_NOT_SUPPORTED:235:provider asym cipher not supported
809EVP_R_PROVIDER_KEYMGMT_FAILURE:233:provider keymgmt failure
810EVP_R_PROVIDER_KEYMGMT_NOT_SUPPORTED:236:provider keymgmt not supported
811EVP_R_PROVIDER_SIGNATURE_FAILURE:234:provider signature failure
812EVP_R_PROVIDER_SIGNATURE_NOT_SUPPORTED:237:provider signature not supported
813EVP_R_PUBLIC_KEY_NOT_RSA:106:public key not rsa
814EVP_R_SETTING_XOF_FAILED:227:setting xof failed
815EVP_R_SET_DEFAULT_PROPERTY_FAILURE:209:set default property failure
816EVP_R_SIGNATURE_TYPE_AND_KEY_TYPE_INCOMPATIBLE:228:\
817	signature type and key type incompatible
818EVP_R_TOO_MANY_PIPES:231:too many pipes
819EVP_R_TOO_MANY_RECORDS:183:too many records
820EVP_R_UNABLE_TO_ENABLE_LOCKING:212:unable to enable locking
821EVP_R_UNABLE_TO_GET_MAXIMUM_REQUEST_SIZE:215:unable to get maximum request size
822EVP_R_UNABLE_TO_GET_RANDOM_STRENGTH:216:unable to get random strength
823EVP_R_UNABLE_TO_LOCK_CONTEXT:211:unable to lock context
824EVP_R_UNABLE_TO_SET_CALLBACKS:217:unable to set callbacks
825EVP_R_UNKNOWN_BITS:166:unknown bits
826EVP_R_UNKNOWN_CIPHER:160:unknown cipher
827EVP_R_UNKNOWN_DIGEST:161:unknown digest
828EVP_R_UNKNOWN_KEY_TYPE:207:unknown key type
829EVP_R_UNKNOWN_MAX_SIZE:167:unknown max size
830EVP_R_UNKNOWN_OPTION:169:unknown option
831EVP_R_UNKNOWN_PBE_ALGORITHM:121:unknown pbe algorithm
832EVP_R_UNKNOWN_SECURITY_BITS:168:unknown security bits
833EVP_R_UNSUPPORTED_ALGORITHM:156:unsupported algorithm
834EVP_R_UNSUPPORTED_CIPHER:107:unsupported cipher
835EVP_R_UNSUPPORTED_KEYLENGTH:123:unsupported keylength
836EVP_R_UNSUPPORTED_KEY_DERIVATION_FUNCTION:124:\
837	unsupported key derivation function
838EVP_R_UNSUPPORTED_KEY_SIZE:108:unsupported key size
839EVP_R_UNSUPPORTED_KEY_TYPE:224:unsupported key type
840EVP_R_UNSUPPORTED_NUMBER_OF_ROUNDS:135:unsupported number of rounds
841EVP_R_UNSUPPORTED_PRF:125:unsupported prf
842EVP_R_UNSUPPORTED_PRIVATE_KEY_ALGORITHM:118:unsupported private key algorithm
843EVP_R_UNSUPPORTED_SALT_TYPE:126:unsupported salt type
844EVP_R_UPDATE_ERROR:189:update error
845EVP_R_WRAP_MODE_NOT_ALLOWED:170:wrap mode not allowed
846EVP_R_WRONG_FINAL_BLOCK_LENGTH:109:wrong final block length
847EVP_R_XTS_DATA_UNIT_IS_TOO_LARGE:191:xts data unit is too large
848EVP_R_XTS_DUPLICATED_KEYS:192:xts duplicated keys
849HTTP_R_ASN1_LEN_EXCEEDS_MAX_RESP_LEN:108:asn1 len exceeds max resp len
850HTTP_R_CONNECT_FAILURE:100:connect failure
851HTTP_R_CONTENT_TYPE_MISMATCH:131:content type mismatch
852HTTP_R_ERROR_PARSING_ASN1_LENGTH:109:error parsing asn1 length
853HTTP_R_ERROR_PARSING_CONTENT_LENGTH:119:error parsing content length
854HTTP_R_ERROR_PARSING_URL:101:error parsing url
855HTTP_R_ERROR_RECEIVING:103:error receiving
856HTTP_R_ERROR_SENDING:102:error sending
857HTTP_R_FAILED_READING_DATA:128:failed reading data
858HTTP_R_HEADER_PARSE_ERROR:126:header parse error
859HTTP_R_INCONSISTENT_CONTENT_LENGTH:120:inconsistent content length
860HTTP_R_INVALID_PORT_NUMBER:123:invalid port number
861HTTP_R_INVALID_URL_PATH:125:invalid url path
862HTTP_R_INVALID_URL_SCHEME:124:invalid url scheme
863HTTP_R_MAX_RESP_LEN_EXCEEDED:117:max resp len exceeded
864HTTP_R_MISSING_ASN1_ENCODING:110:missing asn1 encoding
865HTTP_R_MISSING_CONTENT_TYPE:121:missing content type
866HTTP_R_MISSING_REDIRECT_LOCATION:111:missing redirect location
867HTTP_R_RECEIVED_ERROR:105:received error
868HTTP_R_RECEIVED_WRONG_HTTP_VERSION:106:received wrong http version
869HTTP_R_REDIRECTION_FROM_HTTPS_TO_HTTP:112:redirection from https to http
870HTTP_R_REDIRECTION_NOT_ENABLED:116:redirection not enabled
871HTTP_R_RESPONSE_LINE_TOO_LONG:113:response line too long
872HTTP_R_RESPONSE_PARSE_ERROR:104:response parse error
873HTTP_R_RESPONSE_TOO_MANY_HDRLINES:130:response too many hdrlines
874HTTP_R_RETRY_TIMEOUT:129:retry timeout
875HTTP_R_SERVER_CANCELED_CONNECTION:127:server canceled connection
876HTTP_R_SOCK_NOT_SUPPORTED:122:sock not supported
877HTTP_R_STATUS_CODE_UNSUPPORTED:114:status code unsupported
878HTTP_R_TLS_NOT_ENABLED:107:tls not enabled
879HTTP_R_TOO_MANY_REDIRECTIONS:115:too many redirections
880HTTP_R_UNEXPECTED_CONTENT_TYPE:118:unexpected content type
881OBJ_R_OID_EXISTS:102:oid exists
882OBJ_R_UNKNOWN_NID:101:unknown nid
883OBJ_R_UNKNOWN_OBJECT_NAME:103:unknown object name
884OCSP_R_CERTIFICATE_VERIFY_ERROR:101:certificate verify error
885OCSP_R_DIGEST_ERR:102:digest err
886OCSP_R_DIGEST_NAME_ERR:106:digest name err
887OCSP_R_DIGEST_SIZE_ERR:107:digest size err
888OCSP_R_ERROR_IN_NEXTUPDATE_FIELD:122:error in nextupdate field
889OCSP_R_ERROR_IN_THISUPDATE_FIELD:123:error in thisupdate field
890OCSP_R_MISSING_OCSPSIGNING_USAGE:103:missing ocspsigning usage
891OCSP_R_NEXTUPDATE_BEFORE_THISUPDATE:124:nextupdate before thisupdate
892OCSP_R_NOT_BASIC_RESPONSE:104:not basic response
893OCSP_R_NO_CERTIFICATES_IN_CHAIN:105:no certificates in chain
894OCSP_R_NO_RESPONSE_DATA:108:no response data
895OCSP_R_NO_REVOKED_TIME:109:no revoked time
896OCSP_R_NO_SIGNER_KEY:130:no signer key
897OCSP_R_PRIVATE_KEY_DOES_NOT_MATCH_CERTIFICATE:110:\
898	private key does not match certificate
899OCSP_R_REQUEST_NOT_SIGNED:128:request not signed
900OCSP_R_RESPONSE_CONTAINS_NO_REVOCATION_DATA:111:\
901	response contains no revocation data
902OCSP_R_ROOT_CA_NOT_TRUSTED:112:root ca not trusted
903OCSP_R_SIGNATURE_FAILURE:117:signature failure
904OCSP_R_SIGNER_CERTIFICATE_NOT_FOUND:118:signer certificate not found
905OCSP_R_STATUS_EXPIRED:125:status expired
906OCSP_R_STATUS_NOT_YET_VALID:126:status not yet valid
907OCSP_R_STATUS_TOO_OLD:127:status too old
908OCSP_R_UNKNOWN_MESSAGE_DIGEST:119:unknown message digest
909OCSP_R_UNKNOWN_NID:120:unknown nid
910OCSP_R_UNSUPPORTED_REQUESTORNAME_TYPE:129:unsupported requestorname type
911OSSL_DECODER_R_COULD_NOT_DECODE_OBJECT:101:could not decode object
912OSSL_DECODER_R_DECODER_NOT_FOUND:102:decoder not found
913OSSL_DECODER_R_MISSING_GET_PARAMS:100:missing get params
914OSSL_ENCODER_R_ENCODER_NOT_FOUND:101:encoder not found
915OSSL_ENCODER_R_INCORRECT_PROPERTY_QUERY:100:incorrect property query
916OSSL_ENCODER_R_MISSING_GET_PARAMS:102:missing get params
917OSSL_STORE_R_AMBIGUOUS_CONTENT_TYPE:107:ambiguous content type
918OSSL_STORE_R_BAD_PASSWORD_READ:115:bad password read
919OSSL_STORE_R_ERROR_VERIFYING_PKCS12_MAC:113:error verifying pkcs12 mac
920OSSL_STORE_R_FINGERPRINT_SIZE_DOES_NOT_MATCH_DIGEST:121:\
921	fingerprint size does not match digest
922OSSL_STORE_R_INVALID_SCHEME:106:invalid scheme
923OSSL_STORE_R_IS_NOT_A:112:is not a
924OSSL_STORE_R_LOADER_INCOMPLETE:116:loader incomplete
925OSSL_STORE_R_LOADING_STARTED:117:loading started
926OSSL_STORE_R_NOT_A_CERTIFICATE:100:not a certificate
927OSSL_STORE_R_NOT_A_CRL:101:not a crl
928OSSL_STORE_R_NOT_A_NAME:103:not a name
929OSSL_STORE_R_NOT_A_PRIVATE_KEY:102:not a private key
930OSSL_STORE_R_NOT_A_PUBLIC_KEY:122:not a public key
931OSSL_STORE_R_NOT_PARAMETERS:104:not parameters
932OSSL_STORE_R_NO_LOADERS_FOUND:123:no loaders found
933OSSL_STORE_R_PASSPHRASE_CALLBACK_ERROR:114:passphrase callback error
934OSSL_STORE_R_PATH_MUST_BE_ABSOLUTE:108:path must be absolute
935OSSL_STORE_R_SEARCH_ONLY_SUPPORTED_FOR_DIRECTORIES:119:\
936	search only supported for directories
937OSSL_STORE_R_UI_PROCESS_INTERRUPTED_OR_CANCELLED:109:\
938	ui process interrupted or cancelled
939OSSL_STORE_R_UNREGISTERED_SCHEME:105:unregistered scheme
940OSSL_STORE_R_UNSUPPORTED_CONTENT_TYPE:110:unsupported content type
941OSSL_STORE_R_UNSUPPORTED_OPERATION:118:unsupported operation
942OSSL_STORE_R_UNSUPPORTED_SEARCH_TYPE:120:unsupported search type
943OSSL_STORE_R_URI_AUTHORITY_UNSUPPORTED:111:uri authority unsupported
944PEM_R_BAD_BASE64_DECODE:100:bad base64 decode
945PEM_R_BAD_DECRYPT:101:bad decrypt
946PEM_R_BAD_END_LINE:102:bad end line
947PEM_R_BAD_IV_CHARS:103:bad iv chars
948PEM_R_BAD_MAGIC_NUMBER:116:bad magic number
949PEM_R_BAD_PASSWORD_READ:104:bad password read
950PEM_R_BAD_VERSION_NUMBER:117:bad version number
951PEM_R_BIO_WRITE_FAILURE:118:bio write failure
952PEM_R_CIPHER_IS_NULL:127:cipher is null
953PEM_R_ERROR_CONVERTING_PRIVATE_KEY:115:error converting private key
954PEM_R_EXPECTING_DSS_KEY_BLOB:131:expecting dss key blob
955PEM_R_EXPECTING_PRIVATE_KEY_BLOB:119:expecting private key blob
956PEM_R_EXPECTING_PUBLIC_KEY_BLOB:120:expecting public key blob
957PEM_R_EXPECTING_RSA_KEY_BLOB:132:expecting rsa key blob
958PEM_R_HEADER_TOO_LONG:128:header too long
959PEM_R_INCONSISTENT_HEADER:121:inconsistent header
960PEM_R_KEYBLOB_HEADER_PARSE_ERROR:122:keyblob header parse error
961PEM_R_KEYBLOB_TOO_SHORT:123:keyblob too short
962PEM_R_MISSING_DEK_IV:129:missing dek iv
963PEM_R_NOT_DEK_INFO:105:not dek info
964PEM_R_NOT_ENCRYPTED:106:not encrypted
965PEM_R_NOT_PROC_TYPE:107:not proc type
966PEM_R_NO_START_LINE:108:no start line
967PEM_R_PROBLEMS_GETTING_PASSWORD:109:problems getting password
968PEM_R_PVK_DATA_TOO_SHORT:124:pvk data too short
969PEM_R_PVK_TOO_SHORT:125:pvk too short
970PEM_R_READ_KEY:111:read key
971PEM_R_SHORT_HEADER:112:short header
972PEM_R_UNEXPECTED_DEK_IV:130:unexpected dek iv
973PEM_R_UNSUPPORTED_CIPHER:113:unsupported cipher
974PEM_R_UNSUPPORTED_ENCRYPTION:114:unsupported encryption
975PEM_R_UNSUPPORTED_KEY_COMPONENTS:126:unsupported key components
976PEM_R_UNSUPPORTED_PUBLIC_KEY_TYPE:110:unsupported public key type
977PEM_R_UNSUPPORTED_PVK_KEY_TYPE:133:unsupported pvk key type
978PKCS12_R_CALLBACK_FAILED:115:callback failed
979PKCS12_R_CANT_PACK_STRUCTURE:100:can't pack structure
980PKCS12_R_CONTENT_TYPE_NOT_DATA:121:content type not data
981PKCS12_R_DECODE_ERROR:101:decode error
982PKCS12_R_ENCODE_ERROR:102:encode error
983PKCS12_R_ENCRYPT_ERROR:103:encrypt error
984PKCS12_R_ERROR_SETTING_ENCRYPTED_DATA_TYPE:120:error setting encrypted data type
985PKCS12_R_INVALID_NULL_ARGUMENT:104:invalid null argument
986PKCS12_R_INVALID_NULL_PKCS12_POINTER:105:invalid null pkcs12 pointer
987PKCS12_R_INVALID_TYPE:112:invalid type
988PKCS12_R_IV_GEN_ERROR:106:iv gen error
989PKCS12_R_KEY_GEN_ERROR:107:key gen error
990PKCS12_R_MAC_ABSENT:108:mac absent
991PKCS12_R_MAC_GENERATION_ERROR:109:mac generation error
992PKCS12_R_MAC_SETUP_ERROR:110:mac setup error
993PKCS12_R_MAC_STRING_SET_ERROR:111:mac string set error
994PKCS12_R_MAC_VERIFY_FAILURE:113:mac verify failure
995PKCS12_R_PARSE_ERROR:114:parse error
996PKCS12_R_PKCS12_CIPHERFINAL_ERROR:116:pkcs12 cipherfinal error
997PKCS12_R_UNKNOWN_DIGEST_ALGORITHM:118:unknown digest algorithm
998PKCS12_R_UNSUPPORTED_PKCS12_MODE:119:unsupported pkcs12 mode
999PKCS7_R_CERTIFICATE_VERIFY_ERROR:117:certificate verify error
1000PKCS7_R_CIPHER_HAS_NO_OBJECT_IDENTIFIER:144:cipher has no object identifier
1001PKCS7_R_CIPHER_NOT_INITIALIZED:116:cipher not initialized
1002PKCS7_R_CONTENT_AND_DATA_PRESENT:118:content and data present
1003PKCS7_R_CTRL_ERROR:152:ctrl error
1004PKCS7_R_DECRYPT_ERROR:119:decrypt error
1005PKCS7_R_DIGEST_FAILURE:101:digest failure
1006PKCS7_R_ENCRYPTION_CTRL_FAILURE:149:encryption ctrl failure
1007PKCS7_R_ENCRYPTION_NOT_SUPPORTED_FOR_THIS_KEY_TYPE:150:\
1008	encryption not supported for this key type
1009PKCS7_R_ERROR_ADDING_RECIPIENT:120:error adding recipient
1010PKCS7_R_ERROR_SETTING_CIPHER:121:error setting cipher
1011PKCS7_R_INVALID_NULL_POINTER:143:invalid null pointer
1012PKCS7_R_INVALID_SIGNED_DATA_TYPE:155:invalid signed data type
1013PKCS7_R_NO_CONTENT:122:no content
1014PKCS7_R_NO_DEFAULT_DIGEST:151:no default digest
1015PKCS7_R_NO_MATCHING_DIGEST_TYPE_FOUND:154:no matching digest type found
1016PKCS7_R_NO_RECIPIENT_MATCHES_CERTIFICATE:115:no recipient matches certificate
1017PKCS7_R_NO_SIGNATURES_ON_DATA:123:no signatures on data
1018PKCS7_R_NO_SIGNERS:142:no signers
1019PKCS7_R_OPERATION_NOT_SUPPORTED_ON_THIS_TYPE:104:\
1020	operation not supported on this type
1021PKCS7_R_PKCS7_ADD_SIGNATURE_ERROR:124:pkcs7 add signature error
1022PKCS7_R_PKCS7_ADD_SIGNER_ERROR:153:pkcs7 add signer error
1023PKCS7_R_PKCS7_DATASIGN:145:pkcs7 datasign
1024PKCS7_R_PRIVATE_KEY_DOES_NOT_MATCH_CERTIFICATE:127:\
1025	private key does not match certificate
1026PKCS7_R_SIGNATURE_FAILURE:105:signature failure
1027PKCS7_R_SIGNER_CERTIFICATE_NOT_FOUND:128:signer certificate not found
1028PKCS7_R_SIGNING_CTRL_FAILURE:147:signing ctrl failure
1029PKCS7_R_SIGNING_NOT_SUPPORTED_FOR_THIS_KEY_TYPE:148:\
1030	signing not supported for this key type
1031PKCS7_R_SMIME_TEXT_ERROR:129:smime text error
1032PKCS7_R_UNABLE_TO_FIND_CERTIFICATE:106:unable to find certificate
1033PKCS7_R_UNABLE_TO_FIND_MEM_BIO:107:unable to find mem bio
1034PKCS7_R_UNABLE_TO_FIND_MESSAGE_DIGEST:108:unable to find message digest
1035PKCS7_R_UNKNOWN_DIGEST_TYPE:109:unknown digest type
1036PKCS7_R_UNKNOWN_OPERATION:110:unknown operation
1037PKCS7_R_UNSUPPORTED_CIPHER_TYPE:111:unsupported cipher type
1038PKCS7_R_UNSUPPORTED_CONTENT_TYPE:112:unsupported content type
1039PKCS7_R_WRONG_CONTENT_TYPE:113:wrong content type
1040PKCS7_R_WRONG_PKCS7_TYPE:114:wrong pkcs7 type
1041PROP_R_NAME_TOO_LONG:100:name too long
1042PROP_R_NOT_AN_ASCII_CHARACTER:101:not an ascii character
1043PROP_R_NOT_AN_HEXADECIMAL_DIGIT:102:not an hexadecimal digit
1044PROP_R_NOT_AN_IDENTIFIER:103:not an identifier
1045PROP_R_NOT_AN_OCTAL_DIGIT:104:not an octal digit
1046PROP_R_NOT_A_DECIMAL_DIGIT:105:not a decimal digit
1047PROP_R_NO_MATCHING_STRING_DELIMITER:106:no matching string delimiter
1048PROP_R_NO_VALUE:107:no value
1049PROP_R_PARSE_FAILED:108:parse failed
1050PROP_R_STRING_TOO_LONG:109:string too long
1051PROP_R_TRAILING_CHARACTERS:110:trailing characters
1052PROV_R_ADDITIONAL_INPUT_TOO_LONG:184:additional input too long
1053PROV_R_ALGORITHM_MISMATCH:173:algorithm mismatch
1054PROV_R_ALREADY_INSTANTIATED:185:already instantiated
1055PROV_R_BAD_DECRYPT:100:bad decrypt
1056PROV_R_BAD_ENCODING:141:bad encoding
1057PROV_R_BAD_LENGTH:142:bad length
1058PROV_R_BAD_TLS_CLIENT_VERSION:161:bad tls client version
1059PROV_R_BN_ERROR:160:bn error
1060PROV_R_CIPHER_OPERATION_FAILED:102:cipher operation failed
1061PROV_R_COFACTOR_REQUIRED:236:cofactor required
1062PROV_R_DERIVATION_FUNCTION_INIT_FAILED:205:derivation function init failed
1063PROV_R_DIGEST_NOT_ALLOWED:174:digest not allowed
1064PROV_R_EMS_NOT_ENABLED:233:ems not enabled
1065PROV_R_ENTROPY_SOURCE_FAILED_CONTINUOUS_TESTS:244:\
1066	entropy source failed continuous tests
1067PROV_R_ENTROPY_SOURCE_STRENGTH_TOO_WEAK:186:entropy source strength too weak
1068PROV_R_ERROR_INSTANTIATING_DRBG:188:error instantiating drbg
1069PROV_R_ERROR_RETRIEVING_ENTROPY:189:error retrieving entropy
1070PROV_R_ERROR_RETRIEVING_NONCE:190:error retrieving nonce
1071PROV_R_FAILED_DURING_DERIVATION:164:failed during derivation
1072PROV_R_FAILED_TO_CREATE_LOCK:180:failed to create lock
1073PROV_R_FAILED_TO_DECRYPT:162:failed to decrypt
1074PROV_R_FAILED_TO_GENERATE_KEY:121:failed to generate key
1075PROV_R_FAILED_TO_GET_PARAMETER:103:failed to get parameter
1076PROV_R_FAILED_TO_SET_PARAMETER:104:failed to set parameter
1077PROV_R_FAILED_TO_SIGN:175:failed to sign
1078PROV_R_FINAL_CALL_OUT_OF_ORDER:237:final call out of order
1079PROV_R_FIPS_MODULE_CONDITIONAL_ERROR:227:fips module conditional error
1080PROV_R_FIPS_MODULE_ENTERING_ERROR_STATE:224:fips module entering error state
1081PROV_R_FIPS_MODULE_IMPORT_PCT_ERROR:253:fips module import pct error
1082PROV_R_FIPS_MODULE_IN_ERROR_STATE:225:fips module in error state
1083PROV_R_GENERATE_ERROR:191:generate error
1084PROV_R_ILLEGAL_OR_UNSUPPORTED_PADDING_MODE:165:\
1085	illegal or unsupported padding mode
1086PROV_R_INDICATOR_INTEGRITY_FAILURE:210:indicator integrity failure
1087PROV_R_INIT_CALL_OUT_OF_ORDER:238:init call out of order
1088PROV_R_INSUFFICIENT_DRBG_STRENGTH:181:insufficient drbg strength
1089PROV_R_INVALID_AAD:108:invalid aad
1090PROV_R_INVALID_AEAD:231:invalid aead
1091PROV_R_INVALID_CONFIG_DATA:211:invalid config data
1092PROV_R_INVALID_CONSTANT_LENGTH:157:invalid constant length
1093PROV_R_INVALID_CURVE:176:invalid curve
1094PROV_R_INVALID_CUSTOM_LENGTH:111:invalid custom length
1095PROV_R_INVALID_DATA:115:invalid data
1096PROV_R_INVALID_DIGEST:122:invalid digest
1097PROV_R_INVALID_DIGEST_LENGTH:166:invalid digest length
1098PROV_R_INVALID_DIGEST_SIZE:218:invalid digest size
1099PROV_R_INVALID_EDDSA_INSTANCE_FOR_ATTEMPTED_OPERATION:243:\
1100	invalid eddsa instance for attempted operation
1101PROV_R_INVALID_INPUT_LENGTH:230:invalid input length
1102PROV_R_INVALID_ITERATION_COUNT:123:invalid iteration count
1103PROV_R_INVALID_IV_LENGTH:109:invalid iv length
1104PROV_R_INVALID_KDF:232:invalid kdf
1105PROV_R_INVALID_KEY:158:invalid key
1106PROV_R_INVALID_KEY_LENGTH:105:invalid key length
1107PROV_R_INVALID_MAC:151:invalid mac
1108PROV_R_INVALID_MEMORY_SIZE:235:invalid memory size
1109PROV_R_INVALID_MGF1_MD:167:invalid mgf1 md
1110PROV_R_INVALID_MODE:125:invalid mode
1111PROV_R_INVALID_OUTPUT_LENGTH:217:invalid output length
1112PROV_R_INVALID_PADDING_MODE:168:invalid padding mode
1113PROV_R_INVALID_PREHASHED_DIGEST_LENGTH:241:invalid prehashed digest length
1114PROV_R_INVALID_PUBINFO:198:invalid pubinfo
1115PROV_R_INVALID_SALT_LENGTH:112:invalid salt length
1116PROV_R_INVALID_SEED_LENGTH:154:invalid seed length
1117PROV_R_INVALID_SIGNATURE_SIZE:179:invalid signature size
1118PROV_R_INVALID_STATE:212:invalid state
1119PROV_R_INVALID_TAG:110:invalid tag
1120PROV_R_INVALID_TAG_LENGTH:118:invalid tag length
1121PROV_R_INVALID_THREAD_POOL_SIZE:234:invalid thread pool size
1122PROV_R_INVALID_UKM_LENGTH:200:invalid ukm length
1123PROV_R_INVALID_X931_DIGEST:170:invalid x931 digest
1124PROV_R_IN_ERROR_STATE:192:in error state
1125PROV_R_KEY_SETUP_FAILED:101:key setup failed
1126PROV_R_KEY_SIZE_TOO_SMALL:171:key size too small
1127PROV_R_LENGTH_TOO_LARGE:202:length too large
1128PROV_R_MISMATCHING_DOMAIN_PARAMETERS:203:mismatching domain parameters
1129PROV_R_MISSING_CEK_ALG:144:missing cek alg
1130PROV_R_MISSING_CIPHER:155:missing cipher
1131PROV_R_MISSING_CONFIG_DATA:213:missing config data
1132PROV_R_MISSING_CONSTANT:156:missing constant
1133PROV_R_MISSING_KEY:128:missing key
1134PROV_R_MISSING_MAC:150:missing mac
1135PROV_R_MISSING_MESSAGE_DIGEST:129:missing message digest
1136PROV_R_MISSING_OID:209:missing OID
1137PROV_R_MISSING_PASS:130:missing pass
1138PROV_R_MISSING_SALT:131:missing salt
1139PROV_R_MISSING_SECRET:132:missing secret
1140PROV_R_MISSING_SEED:140:missing seed
1141PROV_R_MISSING_SESSION_ID:133:missing session id
1142PROV_R_MISSING_TYPE:134:missing type
1143PROV_R_MISSING_XCGHASH:135:missing xcghash
1144PROV_R_ML_DSA_NO_FORMAT:245:ml dsa no format
1145PROV_R_ML_KEM_NO_FORMAT:246:ml kem no format
1146PROV_R_MODULE_INTEGRITY_FAILURE:214:module integrity failure
1147PROV_R_NOT_A_PRIVATE_KEY:221:not a private key
1148PROV_R_NOT_A_PUBLIC_KEY:220:not a public key
1149PROV_R_NOT_INSTANTIATED:193:not instantiated
1150PROV_R_NOT_PARAMETERS:226:not parameters
1151PROV_R_NOT_SUPPORTED:136:not supported
1152PROV_R_NOT_XOF_OR_INVALID_LENGTH:113:not xof or invalid length
1153PROV_R_NO_INSTANCE_ALLOWED:242:no instance allowed
1154PROV_R_NO_KEY_SET:114:no key set
1155PROV_R_NO_PARAMETERS_SET:177:no parameters set
1156PROV_R_NULL_LENGTH_POINTER:247:null length pointer
1157PROV_R_NULL_OUTPUT_BUFFER:248:null output buffer
1158PROV_R_ONESHOT_CALL_OUT_OF_ORDER:239:oneshot call out of order
1159PROV_R_OPERATION_NOT_SUPPORTED_FOR_THIS_KEYTYPE:178:\
1160	operation not supported for this keytype
1161PROV_R_OUTPUT_BUFFER_TOO_SMALL:106:output buffer too small
1162PROV_R_PARENT_CANNOT_GENERATE_RANDOM_NUMBERS:228:\
1163	parent cannot generate random numbers
1164PROV_R_PARENT_CANNOT_SUPPLY_ENTROPY_SEED:187:parent cannot supply entropy seed
1165PROV_R_PARENT_LOCKING_NOT_ENABLED:182:parent locking not enabled
1166PROV_R_PARENT_STRENGTH_TOO_WEAK:194:parent strength too weak
1167PROV_R_PATH_MUST_BE_ABSOLUTE:219:path must be absolute
1168PROV_R_PERSONALISATION_STRING_TOO_LONG:195:personalisation string too long
1169PROV_R_PSS_SALTLEN_TOO_SMALL:172:pss saltlen too small
1170PROV_R_REQUEST_TOO_LARGE_FOR_DRBG:196:request too large for drbg
1171PROV_R_REQUIRE_CTR_MODE_CIPHER:206:require ctr mode cipher
1172PROV_R_RESEED_ERROR:197:reseed error
1173PROV_R_SEARCH_ONLY_SUPPORTED_FOR_DIRECTORIES:222:\
1174	search only supported for directories
1175PROV_R_SEED_SOURCES_MUST_NOT_HAVE_A_PARENT:229:\
1176	seed sources must not have a parent
1177PROV_R_SELF_TEST_KAT_FAILURE:215:self test kat failure
1178PROV_R_SELF_TEST_POST_FAILURE:216:self test post failure
1179PROV_R_TAG_NOT_NEEDED:120:tag not needed
1180PROV_R_TAG_NOT_SET:119:tag not set
1181PROV_R_TOO_MANY_RECORDS:126:too many records
1182PROV_R_UNABLE_TO_FIND_CIPHERS:207:unable to find ciphers
1183PROV_R_UNABLE_TO_GET_PARENT_STRENGTH:199:unable to get parent strength
1184PROV_R_UNABLE_TO_GET_PASSPHRASE:159:unable to get passphrase
1185PROV_R_UNABLE_TO_INITIALISE_CIPHERS:208:unable to initialise ciphers
1186PROV_R_UNABLE_TO_LOAD_SHA256:147:unable to load sha256
1187PROV_R_UNABLE_TO_LOCK_PARENT:201:unable to lock parent
1188PROV_R_UNABLE_TO_RESEED:204:unable to reseed
1189PROV_R_UNEXPECTED_KEY_PARAMETERS:249:unexpected key parameters
1190PROV_R_UNSUPPORTED_CEK_ALG:145:unsupported cek alg
1191PROV_R_UNSUPPORTED_KEY_SIZE:153:unsupported key size
1192PROV_R_UNSUPPORTED_MAC_TYPE:137:unsupported mac type
1193PROV_R_UNSUPPORTED_NUMBER_OF_ROUNDS:152:unsupported number of rounds
1194PROV_R_UNSUPPORTED_SELECTION:250:unsupported selection
1195PROV_R_UPDATE_CALL_OUT_OF_ORDER:240:update call out of order
1196PROV_R_URI_AUTHORITY_UNSUPPORTED:223:uri authority unsupported
1197PROV_R_VALUE_ERROR:138:value error
1198PROV_R_WRONG_CIPHERTEXT_SIZE:251:wrong ciphertext size
1199PROV_R_WRONG_FINAL_BLOCK_LENGTH:107:wrong final block length
1200PROV_R_WRONG_OUTPUT_BUFFER_SIZE:139:wrong output buffer size
1201PROV_R_XOF_DIGESTS_NOT_ALLOWED:183:xof digests not allowed
1202PROV_R_XTS_DATA_UNIT_IS_TOO_LARGE:148:xts data unit is too large
1203PROV_R_XTS_DUPLICATED_KEYS:149:xts duplicated keys
1204RAND_R_ADDITIONAL_INPUT_TOO_LONG:102:additional input too long
1205RAND_R_ALREADY_INSTANTIATED:103:already instantiated
1206RAND_R_ARGUMENT_OUT_OF_RANGE:105:argument out of range
1207RAND_R_CANNOT_OPEN_FILE:121:Cannot open file
1208RAND_R_DRBG_ALREADY_INITIALIZED:129:drbg already initialized
1209RAND_R_DRBG_NOT_INITIALISED:104:drbg not initialised
1210RAND_R_ENTROPY_INPUT_TOO_LONG:106:entropy input too long
1211RAND_R_ENTROPY_OUT_OF_RANGE:124:entropy out of range
1212RAND_R_ERROR_ENTROPY_POOL_WAS_IGNORED:127:error entropy pool was ignored
1213RAND_R_ERROR_INITIALISING_DRBG:107:error initialising drbg
1214RAND_R_ERROR_INSTANTIATING_DRBG:108:error instantiating drbg
1215RAND_R_ERROR_RETRIEVING_ADDITIONAL_INPUT:109:error retrieving additional input
1216RAND_R_ERROR_RETRIEVING_ENTROPY:110:error retrieving entropy
1217RAND_R_ERROR_RETRIEVING_NONCE:111:error retrieving nonce
1218RAND_R_FAILED_TO_CREATE_LOCK:126:failed to create lock
1219RAND_R_FUNC_NOT_IMPLEMENTED:101:Function not implemented
1220RAND_R_FWRITE_ERROR:123:Error writing file
1221RAND_R_GENERATE_ERROR:112:generate error
1222RAND_R_INSUFFICIENT_DRBG_STRENGTH:139:insufficient drbg strength
1223RAND_R_INTERNAL_ERROR:113:internal error
1224RAND_R_INVALID_PROPERTY_QUERY:137:invalid property query
1225RAND_R_IN_ERROR_STATE:114:in error state
1226RAND_R_NOT_A_REGULAR_FILE:122:Not a regular file
1227RAND_R_NOT_INSTANTIATED:115:not instantiated
1228RAND_R_NO_DRBG_IMPLEMENTATION_SELECTED:128:no drbg implementation selected
1229RAND_R_PARENT_LOCKING_NOT_ENABLED:130:parent locking not enabled
1230RAND_R_PARENT_STRENGTH_TOO_WEAK:131:parent strength too weak
1231RAND_R_PERSONALISATION_STRING_TOO_LONG:116:personalisation string too long
1232RAND_R_PREDICTION_RESISTANCE_NOT_SUPPORTED:133:\
1233	prediction resistance not supported
1234RAND_R_PRNG_NOT_SEEDED:100:PRNG not seeded
1235RAND_R_RANDOM_POOL_IS_EMPTY:142:random pool is empty
1236RAND_R_RANDOM_POOL_OVERFLOW:125:random pool overflow
1237RAND_R_RANDOM_POOL_UNDERFLOW:134:random pool underflow
1238RAND_R_REQUEST_TOO_LARGE_FOR_DRBG:117:request too large for drbg
1239RAND_R_RESEED_ERROR:118:reseed error
1240RAND_R_SELFTEST_FAILURE:119:selftest failure
1241RAND_R_TOO_LITTLE_NONCE_REQUESTED:135:too little nonce requested
1242RAND_R_TOO_MUCH_NONCE_REQUESTED:136:too much nonce requested
1243RAND_R_UNABLE_TO_CREATE_DRBG:143:unable to create drbg
1244RAND_R_UNABLE_TO_FETCH_DRBG:144:unable to fetch drbg
1245RAND_R_UNABLE_TO_GET_PARENT_RESEED_PROP_COUNTER:141:\
1246	unable to get parent reseed prop counter
1247RAND_R_UNABLE_TO_GET_PARENT_STRENGTH:138:unable to get parent strength
1248RAND_R_UNABLE_TO_LOCK_PARENT:140:unable to lock parent
1249RAND_R_UNSUPPORTED_DRBG_FLAGS:132:unsupported drbg flags
1250RAND_R_UNSUPPORTED_DRBG_TYPE:120:unsupported drbg type
1251RSA_R_ALGORITHM_MISMATCH:100:algorithm mismatch
1252RSA_R_BAD_E_VALUE:101:bad e value
1253RSA_R_BAD_FIXED_HEADER_DECRYPT:102:bad fixed header decrypt
1254RSA_R_BAD_PAD_BYTE_COUNT:103:bad pad byte count
1255RSA_R_BAD_SIGNATURE:104:bad signature
1256RSA_R_BLOCK_TYPE_IS_NOT_01:106:block type is not 01
1257RSA_R_BLOCK_TYPE_IS_NOT_02:107:block type is not 02
1258RSA_R_DATA_GREATER_THAN_MOD_LEN:108:data greater than mod len
1259RSA_R_DATA_TOO_LARGE:109:data too large
1260RSA_R_DATA_TOO_LARGE_FOR_KEY_SIZE:110:data too large for key size
1261RSA_R_DATA_TOO_LARGE_FOR_MODULUS:132:data too large for modulus
1262RSA_R_DATA_TOO_SMALL:111:data too small
1263RSA_R_DATA_TOO_SMALL_FOR_KEY_SIZE:122:data too small for key size
1264RSA_R_DIGEST_DOES_NOT_MATCH:158:digest does not match
1265RSA_R_DIGEST_NOT_ALLOWED:145:digest not allowed
1266RSA_R_DIGEST_TOO_BIG_FOR_RSA_KEY:112:digest too big for rsa key
1267RSA_R_DMP1_NOT_CONGRUENT_TO_D:124:dmp1 not congruent to d
1268RSA_R_DMQ1_NOT_CONGRUENT_TO_D:125:dmq1 not congruent to d
1269RSA_R_D_E_NOT_CONGRUENT_TO_1:123:d e not congruent to 1
1270RSA_R_FIRST_OCTET_INVALID:133:first octet invalid
1271RSA_R_ILLEGAL_OR_UNSUPPORTED_PADDING_MODE:144:\
1272	illegal or unsupported padding mode
1273RSA_R_INVALID_DIGEST:157:invalid digest
1274RSA_R_INVALID_DIGEST_LENGTH:143:invalid digest length
1275RSA_R_INVALID_HEADER:137:invalid header
1276RSA_R_INVALID_KEYPAIR:171:invalid keypair
1277RSA_R_INVALID_KEY_LENGTH:173:invalid key length
1278RSA_R_INVALID_LABEL:160:invalid label
1279RSA_R_INVALID_LENGTH:181:invalid length
1280RSA_R_INVALID_MESSAGE_LENGTH:131:invalid message length
1281RSA_R_INVALID_MGF1_MD:156:invalid mgf1 md
1282RSA_R_INVALID_MODULUS:174:invalid modulus
1283RSA_R_INVALID_MULTI_PRIME_KEY:167:invalid multi prime key
1284RSA_R_INVALID_OAEP_PARAMETERS:161:invalid oaep parameters
1285RSA_R_INVALID_PADDING:138:invalid padding
1286RSA_R_INVALID_PADDING_MODE:141:invalid padding mode
1287RSA_R_INVALID_PSS_PARAMETERS:149:invalid pss parameters
1288RSA_R_INVALID_PSS_SALTLEN:146:invalid pss saltlen
1289RSA_R_INVALID_REQUEST:175:invalid request
1290RSA_R_INVALID_SALT_LENGTH:150:invalid salt length
1291RSA_R_INVALID_STRENGTH:176:invalid strength
1292RSA_R_INVALID_TRAILER:139:invalid trailer
1293RSA_R_INVALID_X931_DIGEST:142:invalid x931 digest
1294RSA_R_IQMP_NOT_INVERSE_OF_Q:126:iqmp not inverse of q
1295RSA_R_KEY_PRIME_NUM_INVALID:165:key prime num invalid
1296RSA_R_KEY_SIZE_TOO_SMALL:120:key size too small
1297RSA_R_LAST_OCTET_INVALID:134:last octet invalid
1298RSA_R_MGF1_DIGEST_NOT_ALLOWED:152:mgf1 digest not allowed
1299RSA_R_MISSING_PRIVATE_KEY:179:missing private key
1300RSA_R_MODULUS_TOO_LARGE:105:modulus too large
1301RSA_R_MP_COEFFICIENT_NOT_INVERSE_OF_R:168:mp coefficient not inverse of r
1302RSA_R_MP_EXPONENT_NOT_CONGRUENT_TO_D:169:mp exponent not congruent to d
1303RSA_R_MP_R_NOT_PRIME:170:mp r not prime
1304RSA_R_NO_PUBLIC_EXPONENT:140:no public exponent
1305RSA_R_NULL_BEFORE_BLOCK_MISSING:113:null before block missing
1306RSA_R_N_DOES_NOT_EQUAL_PRODUCT_OF_PRIMES:172:n does not equal product of primes
1307RSA_R_N_DOES_NOT_EQUAL_P_Q:127:n does not equal p q
1308RSA_R_OAEP_DECODING_ERROR:121:oaep decoding error
1309RSA_R_OPERATION_NOT_SUPPORTED_FOR_THIS_KEYTYPE:148:\
1310	operation not supported for this keytype
1311RSA_R_PADDING_CHECK_FAILED:114:padding check failed
1312RSA_R_PAIRWISE_TEST_FAILURE:177:pairwise test failure
1313RSA_R_PKCS_DECODING_ERROR:159:pkcs decoding error
1314RSA_R_PSS_SALTLEN_TOO_SMALL:164:pss saltlen too small
1315RSA_R_PUB_EXPONENT_OUT_OF_RANGE:178:pub exponent out of range
1316RSA_R_P_NOT_PRIME:128:p not prime
1317RSA_R_Q_NOT_PRIME:129:q not prime
1318RSA_R_RANDOMNESS_SOURCE_STRENGTH_INSUFFICIENT:180:\
1319	randomness source strength insufficient
1320RSA_R_RSA_OPERATIONS_NOT_SUPPORTED:130:rsa operations not supported
1321RSA_R_SLEN_CHECK_FAILED:136:salt length check failed
1322RSA_R_SLEN_RECOVERY_FAILED:135:salt length recovery failed
1323RSA_R_SSLV3_ROLLBACK_ATTACK:115:sslv3 rollback attack
1324RSA_R_THE_ASN1_OBJECT_IDENTIFIER_IS_NOT_KNOWN_FOR_THIS_MD:116:\
1325	the asn1 object identifier is not known for this md
1326RSA_R_UNKNOWN_ALGORITHM_TYPE:117:unknown algorithm type
1327RSA_R_UNKNOWN_DIGEST:166:unknown digest
1328RSA_R_UNKNOWN_MASK_DIGEST:151:unknown mask digest
1329RSA_R_UNKNOWN_PADDING_TYPE:118:unknown padding type
1330RSA_R_UNSUPPORTED_ENCRYPTION_TYPE:162:unsupported encryption type
1331RSA_R_UNSUPPORTED_LABEL_SOURCE:163:unsupported label source
1332RSA_R_UNSUPPORTED_MASK_ALGORITHM:153:unsupported mask algorithm
1333RSA_R_UNSUPPORTED_MASK_PARAMETER:154:unsupported mask parameter
1334RSA_R_UNSUPPORTED_SIGNATURE_TYPE:155:unsupported signature type
1335RSA_R_VALUE_MISSING:147:value missing
1336RSA_R_WRONG_SIGNATURE_LENGTH:119:wrong signature length
1337SM2_R_ASN1_ERROR:100:asn1 error
1338SM2_R_BAD_SIGNATURE:101:bad signature
1339SM2_R_BUFFER_TOO_SMALL:107:buffer too small
1340SM2_R_DIST_ID_TOO_LARGE:110:dist id too large
1341SM2_R_ID_NOT_SET:112:id not set
1342SM2_R_ID_TOO_LARGE:111:id too large
1343SM2_R_INVALID_CURVE:108:invalid curve
1344SM2_R_INVALID_DIGEST:102:invalid digest
1345SM2_R_INVALID_DIGEST_TYPE:103:invalid digest type
1346SM2_R_INVALID_ENCODING:104:invalid encoding
1347SM2_R_INVALID_FIELD:105:invalid field
1348SM2_R_INVALID_PRIVATE_KEY:113:invalid private key
1349SM2_R_NO_PARAMETERS_SET:109:no parameters set
1350SM2_R_USER_ID_TOO_LARGE:106:user id too large
1351SSL_R_APPLICATION_DATA_AFTER_CLOSE_NOTIFY:291:\
1352	application data after close notify
1353SSL_R_APP_DATA_IN_HANDSHAKE:100:app data in handshake
1354SSL_R_ATTEMPT_TO_REUSE_SESSION_IN_DIFFERENT_CONTEXT:272:\
1355	attempt to reuse session in different context
1356SSL_R_AT_LEAST_TLS_1_2_NEEDED_IN_SUITEB_MODE:158:\
1357	at least (D)TLS 1.2 needed in Suite B mode
1358SSL_R_BAD_CERTIFICATE:348:bad certificate
1359SSL_R_BAD_CHANGE_CIPHER_SPEC:103:bad change cipher spec
1360SSL_R_BAD_CIPHER:186:bad cipher
1361SSL_R_BAD_COMPRESSION_ALGORITHM:326:bad compression algorithm
1362SSL_R_BAD_DATA:390:bad data
1363SSL_R_BAD_DATA_RETURNED_BY_CALLBACK:106:bad data returned by callback
1364SSL_R_BAD_DECOMPRESSION:107:bad decompression
1365SSL_R_BAD_DH_VALUE:102:bad dh value
1366SSL_R_BAD_DIGEST_LENGTH:111:bad digest length
1367SSL_R_BAD_EARLY_DATA:233:bad early data
1368SSL_R_BAD_ECC_CERT:304:bad ecc cert
1369SSL_R_BAD_ECPOINT:306:bad ecpoint
1370SSL_R_BAD_EXTENSION:110:bad extension
1371SSL_R_BAD_HANDSHAKE_LENGTH:332:bad handshake length
1372SSL_R_BAD_HANDSHAKE_STATE:236:bad handshake state
1373SSL_R_BAD_HELLO_REQUEST:105:bad hello request
1374SSL_R_BAD_HRR_VERSION:263:bad hrr version
1375SSL_R_BAD_KEY_SHARE:108:bad key share
1376SSL_R_BAD_KEY_UPDATE:122:bad key update
1377SSL_R_BAD_LEGACY_VERSION:292:bad legacy version
1378SSL_R_BAD_LENGTH:271:bad length
1379SSL_R_BAD_PACKET:240:bad packet
1380SSL_R_BAD_PACKET_LENGTH:115:bad packet length
1381SSL_R_BAD_PROTOCOL_VERSION_NUMBER:116:bad protocol version number
1382SSL_R_BAD_PSK:219:bad psk
1383SSL_R_BAD_PSK_IDENTITY:114:bad psk identity
1384SSL_R_BAD_RECORD_TYPE:443:bad record type
1385SSL_R_BAD_RSA_ENCRYPT:119:bad rsa encrypt
1386SSL_R_BAD_SIGNATURE:123:bad signature
1387SSL_R_BAD_SRP_A_LENGTH:347:bad srp a length
1388SSL_R_BAD_SRP_PARAMETERS:371:bad srp parameters
1389SSL_R_BAD_SRTP_MKI_VALUE:352:bad srtp mki value
1390SSL_R_BAD_SRTP_PROTECTION_PROFILE_LIST:353:bad srtp protection profile list
1391SSL_R_BAD_SSL_FILETYPE:124:bad ssl filetype
1392SSL_R_BAD_VALUE:384:bad value
1393SSL_R_BAD_WRITE_RETRY:127:bad write retry
1394SSL_R_BINDER_DOES_NOT_VERIFY:253:binder does not verify
1395SSL_R_BIO_NOT_SET:128:bio not set
1396SSL_R_BLOCK_CIPHER_PAD_IS_WRONG:129:block cipher pad is wrong
1397SSL_R_BN_LIB:130:bn lib
1398SSL_R_CALLBACK_FAILED:234:callback failed
1399SSL_R_CANNOT_CHANGE_CIPHER:109:cannot change cipher
1400SSL_R_CANNOT_GET_GROUP_NAME:299:cannot get group name
1401SSL_R_CA_DN_LENGTH_MISMATCH:131:ca dn length mismatch
1402SSL_R_CA_KEY_TOO_SMALL:397:ca key too small
1403SSL_R_CA_MD_TOO_WEAK:398:ca md too weak
1404SSL_R_CCS_RECEIVED_EARLY:133:ccs received early
1405SSL_R_CERTIFICATE_VERIFY_FAILED:134:certificate verify failed
1406SSL_R_CERT_CB_ERROR:377:cert cb error
1407SSL_R_CERT_LENGTH_MISMATCH:135:cert length mismatch
1408SSL_R_CIPHERSUITE_DIGEST_HAS_CHANGED:218:ciphersuite digest has changed
1409SSL_R_CIPHER_CODE_WRONG_LENGTH:137:cipher code wrong length
1410SSL_R_CLIENTHELLO_TLSEXT:226:clienthello tlsext
1411SSL_R_COMPRESSED_LENGTH_TOO_LONG:140:compressed length too long
1412SSL_R_COMPRESSION_DISABLED:343:compression disabled
1413SSL_R_COMPRESSION_FAILURE:141:compression failure
1414SSL_R_COMPRESSION_ID_NOT_WITHIN_PRIVATE_RANGE:307:\
1415	compression id not within private range
1416SSL_R_COMPRESSION_LIBRARY_ERROR:142:compression library error
1417SSL_R_CONNECTION_TYPE_NOT_SET:144:connection type not set
1418SSL_R_CONN_USE_ONLY:356:conn use only
1419SSL_R_CONTEXT_NOT_DANE_ENABLED:167:context not dane enabled
1420SSL_R_COOKIE_GEN_CALLBACK_FAILURE:400:cookie gen callback failure
1421SSL_R_COOKIE_MISMATCH:308:cookie mismatch
1422SSL_R_COPY_PARAMETERS_FAILED:296:copy parameters failed
1423SSL_R_CUSTOM_EXT_HANDLER_ALREADY_INSTALLED:206:\
1424	custom ext handler already installed
1425SSL_R_DANE_ALREADY_ENABLED:172:dane already enabled
1426SSL_R_DANE_CANNOT_OVERRIDE_MTYPE_FULL:173:dane cannot override mtype full
1427SSL_R_DANE_NOT_ENABLED:175:dane not enabled
1428SSL_R_DANE_TLSA_BAD_CERTIFICATE:180:dane tlsa bad certificate
1429SSL_R_DANE_TLSA_BAD_CERTIFICATE_USAGE:184:dane tlsa bad certificate usage
1430SSL_R_DANE_TLSA_BAD_DATA_LENGTH:189:dane tlsa bad data length
1431SSL_R_DANE_TLSA_BAD_DIGEST_LENGTH:192:dane tlsa bad digest length
1432SSL_R_DANE_TLSA_BAD_MATCHING_TYPE:200:dane tlsa bad matching type
1433SSL_R_DANE_TLSA_BAD_PUBLIC_KEY:201:dane tlsa bad public key
1434SSL_R_DANE_TLSA_BAD_SELECTOR:202:dane tlsa bad selector
1435SSL_R_DANE_TLSA_NULL_DATA:203:dane tlsa null data
1436SSL_R_DATA_BETWEEN_CCS_AND_FINISHED:145:data between ccs and finished
1437SSL_R_DATA_LENGTH_TOO_LONG:146:data length too long
1438SSL_R_DECRYPTION_FAILED:147:decryption failed
1439SSL_R_DECRYPTION_FAILED_OR_BAD_RECORD_MAC:281:\
1440	decryption failed or bad record mac
1441SSL_R_DH_KEY_TOO_SMALL:394:dh key too small
1442SSL_R_DH_PUBLIC_VALUE_LENGTH_IS_WRONG:148:dh public value length is wrong
1443SSL_R_DIGEST_CHECK_FAILED:149:digest check failed
1444SSL_R_DOMAIN_USE_ONLY:422:domain use only
1445SSL_R_DTLS_MESSAGE_TOO_BIG:334:dtls message too big
1446SSL_R_DUPLICATE_COMPRESSION_ID:309:duplicate compression id
1447SSL_R_ECC_CERT_NOT_FOR_SIGNING:318:ecc cert not for signing
1448SSL_R_ECDH_REQUIRED_FOR_SUITEB_MODE:374:ecdh required for suiteb mode
1449SSL_R_EE_KEY_TOO_SMALL:399:ee key too small
1450SSL_R_EMPTY_RAW_PUBLIC_KEY:349:empty raw public key
1451SSL_R_EMPTY_SRTP_PROTECTION_PROFILE_LIST:354:empty srtp protection profile list
1452SSL_R_ENCRYPTED_LENGTH_TOO_LONG:150:encrypted length too long
1453SSL_R_ERROR_IN_RECEIVED_CIPHER_LIST:151:error in received cipher list
1454SSL_R_ERROR_IN_SYSTEM_DEFAULT_CONFIG:419:error in system default config
1455SSL_R_ERROR_SETTING_TLSA_BASE_DOMAIN:204:error setting tlsa base domain
1456SSL_R_EXCEEDS_MAX_FRAGMENT_SIZE:194:exceeds max fragment size
1457SSL_R_EXCESSIVE_MESSAGE_SIZE:152:excessive message size
1458SSL_R_EXTENSION_NOT_RECEIVED:279:extension not received
1459SSL_R_EXTRA_DATA_IN_MESSAGE:153:extra data in message
1460SSL_R_EXT_LENGTH_MISMATCH:163:ext length mismatch
1461SSL_R_FAILED_TO_GET_PARAMETER:316:failed to get parameter
1462SSL_R_FAILED_TO_INIT_ASYNC:405:failed to init async
1463SSL_R_FEATURE_NEGOTIATION_NOT_COMPLETE:417:feature negotiation not complete
1464SSL_R_FEATURE_NOT_RENEGOTIABLE:413:feature not renegotiable
1465SSL_R_FRAGMENTED_CLIENT_HELLO:401:fragmented client hello
1466SSL_R_GOT_A_FIN_BEFORE_A_CCS:154:got a fin before a ccs
1467SSL_R_HTTPS_PROXY_REQUEST:155:https proxy request
1468SSL_R_HTTP_REQUEST:156:http request
1469SSL_R_ILLEGAL_POINT_COMPRESSION:162:illegal point compression
1470SSL_R_ILLEGAL_SUITEB_DIGEST:380:illegal Suite B digest
1471SSL_R_INAPPROPRIATE_FALLBACK:373:inappropriate fallback
1472SSL_R_INCONSISTENT_COMPRESSION:340:inconsistent compression
1473SSL_R_INCONSISTENT_EARLY_DATA_ALPN:222:inconsistent early data alpn
1474SSL_R_INCONSISTENT_EARLY_DATA_SNI:231:inconsistent early data sni
1475SSL_R_INCONSISTENT_EXTMS:104:inconsistent extms
1476SSL_R_INSUFFICIENT_SECURITY:241:insufficient security
1477SSL_R_INVALID_ALERT:205:invalid alert
1478SSL_R_INVALID_CCS_MESSAGE:260:invalid ccs message
1479SSL_R_INVALID_CERTIFICATE_OR_ALG:238:invalid certificate or alg
1480SSL_R_INVALID_COMMAND:280:invalid command
1481SSL_R_INVALID_COMPRESSION_ALGORITHM:341:invalid compression algorithm
1482SSL_R_INVALID_CONFIG:283:invalid config
1483SSL_R_INVALID_CONFIGURATION_NAME:113:invalid configuration name
1484SSL_R_INVALID_CONTEXT:282:invalid context
1485SSL_R_INVALID_CT_VALIDATION_TYPE:212:invalid ct validation type
1486SSL_R_INVALID_KEY_UPDATE_TYPE:120:invalid key update type
1487SSL_R_INVALID_MAX_EARLY_DATA:174:invalid max early data
1488SSL_R_INVALID_NULL_CMD_NAME:385:invalid null cmd name
1489SSL_R_INVALID_RAW_PUBLIC_KEY:350:invalid raw public key
1490SSL_R_INVALID_RECORD:317:invalid record
1491SSL_R_INVALID_SEQUENCE_NUMBER:402:invalid sequence number
1492SSL_R_INVALID_SERVERINFO_DATA:388:invalid serverinfo data
1493SSL_R_INVALID_SESSION_ID:999:invalid session id
1494SSL_R_INVALID_SRP_USERNAME:357:invalid srp username
1495SSL_R_INVALID_STATUS_RESPONSE:328:invalid status response
1496SSL_R_INVALID_TICKET_KEYS_LENGTH:325:invalid ticket keys length
1497SSL_R_LEGACY_SIGALG_DISALLOWED_OR_UNSUPPORTED:333:\
1498	legacy sigalg disallowed or unsupported
1499SSL_R_LENGTH_MISMATCH:159:length mismatch
1500SSL_R_LENGTH_TOO_LONG:404:length too long
1501SSL_R_LENGTH_TOO_SHORT:160:length too short
1502SSL_R_LIBRARY_BUG:274:library bug
1503SSL_R_LIBRARY_HAS_NO_CIPHERS:161:library has no ciphers
1504SSL_R_LISTENER_USE_ONLY:421:listener use only
1505SSL_R_MAXIMUM_ENCRYPTED_PKTS_REACHED:395:maximum encrypted pkts reached
1506SSL_R_MISSING_DSA_SIGNING_CERT:165:missing dsa signing cert
1507SSL_R_MISSING_ECDSA_SIGNING_CERT:381:missing ecdsa signing cert
1508SSL_R_MISSING_FATAL:256:missing fatal
1509SSL_R_MISSING_PARAMETERS:290:missing parameters
1510SSL_R_MISSING_PSK_KEX_MODES_EXTENSION:310:missing psk kex modes extension
1511SSL_R_MISSING_QUIC_TLS_FUNCTIONS:423:missing quic tls functions
1512SSL_R_MISSING_RSA_CERTIFICATE:168:missing rsa certificate
1513SSL_R_MISSING_RSA_ENCRYPTING_CERT:169:missing rsa encrypting cert
1514SSL_R_MISSING_RSA_SIGNING_CERT:170:missing rsa signing cert
1515SSL_R_MISSING_SIGALGS_EXTENSION:112:missing sigalgs extension
1516SSL_R_MISSING_SIGNING_CERT:221:missing signing cert
1517SSL_R_MISSING_SRP_PARAM:358:can't find SRP server param
1518SSL_R_MISSING_SUPPORTED_GROUPS_EXTENSION:209:missing supported groups extension
1519SSL_R_MISSING_SUPPORTED_VERSIONS_EXTENSION:420:\
1520	missing supported versions extension
1521SSL_R_MISSING_TMP_DH_KEY:171:missing tmp dh key
1522SSL_R_MISSING_TMP_ECDH_KEY:311:missing tmp ecdh key
1523SSL_R_MIXED_HANDSHAKE_AND_NON_HANDSHAKE_DATA:293:\
1524	mixed handshake and non handshake data
1525SSL_R_NOT_ON_RECORD_BOUNDARY:182:not on record boundary
1526SSL_R_NOT_REPLACING_CERTIFICATE:289:not replacing certificate
1527SSL_R_NOT_SERVER:284:not server
1528SSL_R_NO_APPLICATION_PROTOCOL:235:no application protocol
1529SSL_R_NO_CERTIFICATES_RETURNED:176:no certificates returned
1530SSL_R_NO_CERTIFICATE_ASSIGNED:177:no certificate assigned
1531SSL_R_NO_CERTIFICATE_SET:179:no certificate set
1532SSL_R_NO_CHANGE_FOLLOWING_HRR:214:no change following hrr
1533SSL_R_NO_CIPHERS_AVAILABLE:181:no ciphers available
1534SSL_R_NO_CIPHERS_SPECIFIED:183:no ciphers specified
1535SSL_R_NO_CIPHER_MATCH:185:no cipher match
1536SSL_R_NO_CLIENT_CERT_METHOD:331:no client cert method
1537SSL_R_NO_COMPRESSION_SPECIFIED:187:no compression specified
1538SSL_R_NO_COOKIE_CALLBACK_SET:287:no cookie callback set
1539SSL_R_NO_GOST_CERTIFICATE_SENT_BY_PEER:330:\
1540	Peer haven't sent GOST certificate, required for selected ciphersuite
1541SSL_R_NO_METHOD_SPECIFIED:188:no method specified
1542SSL_R_NO_PEM_EXTENSIONS:389:no pem extensions
1543SSL_R_NO_PRIVATE_KEY_ASSIGNED:190:no private key assigned
1544SSL_R_NO_PROTOCOLS_AVAILABLE:191:no protocols available
1545SSL_R_NO_RENEGOTIATION:339:no renegotiation
1546SSL_R_NO_REQUIRED_DIGEST:324:no required digest
1547SSL_R_NO_SHARED_CIPHER:193:no shared cipher
1548SSL_R_NO_SHARED_GROUPS:410:no shared groups
1549SSL_R_NO_SHARED_SIGNATURE_ALGORITHMS:376:no shared signature algorithms
1550SSL_R_NO_SRTP_PROFILES:359:no srtp profiles
1551SSL_R_NO_STREAM:355:no stream
1552SSL_R_NO_SUITABLE_DIGEST_ALGORITHM:297:no suitable digest algorithm
1553SSL_R_NO_SUITABLE_GROUPS:295:no suitable groups
1554SSL_R_NO_SUITABLE_KEY_SHARE:101:no suitable key share
1555SSL_R_NO_SUITABLE_RECORD_LAYER:322:no suitable record layer
1556SSL_R_NO_SUITABLE_SIGNATURE_ALGORITHM:118:no suitable signature algorithm
1557SSL_R_NO_VALID_SCTS:216:no valid scts
1558SSL_R_NO_VERIFY_COOKIE_CALLBACK:403:no verify cookie callback
1559SSL_R_NULL_SSL_CTX:195:null ssl ctx
1560SSL_R_NULL_SSL_METHOD_PASSED:196:null ssl method passed
1561SSL_R_OCSP_CALLBACK_FAILURE:305:ocsp callback failure
1562SSL_R_OLD_SESSION_CIPHER_NOT_RETURNED:197:old session cipher not returned
1563SSL_R_OLD_SESSION_COMPRESSION_ALGORITHM_NOT_RETURNED:344:\
1564	old session compression algorithm not returned
1565SSL_R_OVERFLOW_ERROR:237:overflow error
1566SSL_R_PACKET_LENGTH_TOO_LONG:198:packet length too long
1567SSL_R_PARSE_TLSEXT:227:parse tlsext
1568SSL_R_PATH_TOO_LONG:270:path too long
1569SSL_R_PEER_DID_NOT_RETURN_A_CERTIFICATE:199:peer did not return a certificate
1570SSL_R_PEM_NAME_BAD_PREFIX:391:pem name bad prefix
1571SSL_R_PEM_NAME_TOO_SHORT:392:pem name too short
1572SSL_R_PIPELINE_FAILURE:406:pipeline failure
1573SSL_R_POLL_REQUEST_NOT_SUPPORTED:418:poll request not supported
1574SSL_R_POST_HANDSHAKE_AUTH_ENCODING_ERR:278:post handshake auth encoding err
1575SSL_R_PRIVATE_KEY_MISMATCH:288:private key mismatch
1576SSL_R_PROTOCOL_IS_SHUTDOWN:207:protocol is shutdown
1577SSL_R_PSK_IDENTITY_NOT_FOUND:223:psk identity not found
1578SSL_R_PSK_NO_CLIENT_CB:224:psk no client cb
1579SSL_R_PSK_NO_SERVER_CB:225:psk no server cb
1580SSL_R_QUIC_HANDSHAKE_LAYER_ERROR:393:quic handshake layer error
1581SSL_R_QUIC_NETWORK_ERROR:387:quic network error
1582SSL_R_QUIC_PROTOCOL_ERROR:382:quic protocol error
1583SSL_R_READ_BIO_NOT_SET:211:read bio not set
1584SSL_R_READ_TIMEOUT_EXPIRED:312:read timeout expired
1585SSL_R_RECORDS_NOT_RELEASED:321:records not released
1586SSL_R_RECORD_LAYER_FAILURE:313:record layer failure
1587SSL_R_RECORD_LENGTH_MISMATCH:213:record length mismatch
1588SSL_R_RECORD_TOO_SMALL:298:record too small
1589SSL_R_REMOTE_PEER_ADDRESS_NOT_SET:346:remote peer address not set
1590SSL_R_RENEGOTIATE_EXT_TOO_LONG:335:renegotiate ext too long
1591SSL_R_RENEGOTIATION_ENCODING_ERR:336:renegotiation encoding err
1592SSL_R_RENEGOTIATION_MISMATCH:337:renegotiation mismatch
1593SSL_R_REQUEST_PENDING:285:request pending
1594SSL_R_REQUEST_SENT:286:request sent
1595SSL_R_REQUIRED_CIPHER_MISSING:215:required cipher missing
1596SSL_R_REQUIRED_COMPRESSION_ALGORITHM_MISSING:342:\
1597	required compression algorithm missing
1598SSL_R_SCSV_RECEIVED_WHEN_RENEGOTIATING:345:scsv received when renegotiating
1599SSL_R_SCT_VERIFICATION_FAILED:208:sct verification failed
1600SSL_R_SEQUENCE_CTR_WRAPPED:327:sequence ctr wrapped
1601SSL_R_SERVERHELLO_TLSEXT:275:serverhello tlsext
1602SSL_R_SESSION_ID_CONTEXT_UNINITIALIZED:277:session id context uninitialized
1603SSL_R_SHUTDOWN_WHILE_IN_INIT:407:shutdown while in init
1604SSL_R_SIGNATURE_ALGORITHMS_ERROR:360:signature algorithms error
1605SSL_R_SIGNATURE_FOR_NON_SIGNING_CERTIFICATE:220:\
1606	signature for non signing certificate
1607SSL_R_SRP_A_CALC:361:error with the srp params
1608SSL_R_SRTP_COULD_NOT_ALLOCATE_PROFILES:362:srtp could not allocate profiles
1609SSL_R_SRTP_PROTECTION_PROFILE_LIST_TOO_LONG:363:\
1610	srtp protection profile list too long
1611SSL_R_SRTP_UNKNOWN_PROTECTION_PROFILE:364:srtp unknown protection profile
1612SSL_R_SSL3_EXT_INVALID_MAX_FRAGMENT_LENGTH:232:\
1613	ssl3 ext invalid max fragment length
1614SSL_R_SSL3_EXT_INVALID_SERVERNAME:319:ssl3 ext invalid servername
1615SSL_R_SSL3_EXT_INVALID_SERVERNAME_TYPE:320:ssl3 ext invalid servername type
1616SSL_R_SSL3_SESSION_ID_TOO_LONG:300:ssl3 session id too long
1617SSL_R_SSLV3_ALERT_BAD_CERTIFICATE:1042:ssl/tls alert bad certificate
1618SSL_R_SSLV3_ALERT_BAD_RECORD_MAC:1020:ssl/tls alert bad record mac
1619SSL_R_SSLV3_ALERT_CERTIFICATE_EXPIRED:1045:ssl/tls alert certificate expired
1620SSL_R_SSLV3_ALERT_CERTIFICATE_REVOKED:1044:ssl/tls alert certificate revoked
1621SSL_R_SSLV3_ALERT_CERTIFICATE_UNKNOWN:1046:ssl/tls alert certificate unknown
1622SSL_R_SSLV3_ALERT_DECOMPRESSION_FAILURE:1030:ssl/tls alert decompression failure
1623SSL_R_SSLV3_ALERT_HANDSHAKE_FAILURE:1040:ssl/tls alert handshake failure
1624SSL_R_SSLV3_ALERT_ILLEGAL_PARAMETER:1047:ssl/tls alert illegal parameter
1625SSL_R_SSLV3_ALERT_NO_CERTIFICATE:1041:ssl/tls alert no certificate
1626SSL_R_SSLV3_ALERT_UNEXPECTED_MESSAGE:1010:ssl/tls alert unexpected message
1627SSL_R_SSLV3_ALERT_UNSUPPORTED_CERTIFICATE:1043:\
1628	ssl/tls alert unsupported certificate
1629SSL_R_SSL_COMMAND_SECTION_EMPTY:117:ssl command section empty
1630SSL_R_SSL_COMMAND_SECTION_NOT_FOUND:125:ssl command section not found
1631SSL_R_SSL_CTX_HAS_NO_DEFAULT_SSL_VERSION:228:ssl ctx has no default ssl version
1632SSL_R_SSL_HANDSHAKE_FAILURE:229:ssl handshake failure
1633SSL_R_SSL_LIBRARY_HAS_NO_CIPHERS:230:ssl library has no ciphers
1634SSL_R_SSL_NEGATIVE_LENGTH:372:ssl negative length
1635SSL_R_SSL_SECTION_EMPTY:126:ssl section empty
1636SSL_R_SSL_SECTION_NOT_FOUND:136:ssl section not found
1637SSL_R_SSL_SESSION_ID_CALLBACK_FAILED:301:ssl session id callback failed
1638SSL_R_SSL_SESSION_ID_CONFLICT:302:ssl session id conflict
1639SSL_R_SSL_SESSION_ID_CONTEXT_TOO_LONG:273:ssl session id context too long
1640SSL_R_SSL_SESSION_ID_HAS_BAD_LENGTH:303:ssl session id has bad length
1641SSL_R_SSL_SESSION_ID_TOO_LONG:408:ssl session id too long
1642SSL_R_SSL_SESSION_VERSION_MISMATCH:210:ssl session version mismatch
1643SSL_R_STILL_IN_INIT:121:still in init
1644SSL_R_STREAM_COUNT_LIMITED:411:stream count limited
1645SSL_R_STREAM_FINISHED:365:stream finished
1646SSL_R_STREAM_RECV_ONLY:366:stream recv only
1647SSL_R_STREAM_RESET:375:stream reset
1648SSL_R_STREAM_SEND_ONLY:379:stream send only
1649SSL_R_TLSV13_ALERT_CERTIFICATE_REQUIRED:1116:tlsv13 alert certificate required
1650SSL_R_TLSV13_ALERT_MISSING_EXTENSION:1109:tlsv13 alert missing extension
1651SSL_R_TLSV1_ALERT_ACCESS_DENIED:1049:tlsv1 alert access denied
1652SSL_R_TLSV1_ALERT_DECODE_ERROR:1050:tlsv1 alert decode error
1653SSL_R_TLSV1_ALERT_DECRYPTION_FAILED:1021:tlsv1 alert decryption failed
1654SSL_R_TLSV1_ALERT_DECRYPT_ERROR:1051:tlsv1 alert decrypt error
1655SSL_R_TLSV1_ALERT_EXPORT_RESTRICTION:1060:tlsv1 alert export restriction
1656SSL_R_TLSV1_ALERT_INAPPROPRIATE_FALLBACK:1086:tlsv1 alert inappropriate fallback
1657SSL_R_TLSV1_ALERT_INSUFFICIENT_SECURITY:1071:tlsv1 alert insufficient security
1658SSL_R_TLSV1_ALERT_INTERNAL_ERROR:1080:tlsv1 alert internal error
1659SSL_R_TLSV1_ALERT_NO_APPLICATION_PROTOCOL:1120:\
1660	tlsv1 alert no application protocol
1661SSL_R_TLSV1_ALERT_NO_RENEGOTIATION:1100:tlsv1 alert no renegotiation
1662SSL_R_TLSV1_ALERT_PROTOCOL_VERSION:1070:tlsv1 alert protocol version
1663SSL_R_TLSV1_ALERT_RECORD_OVERFLOW:1022:tlsv1 alert record overflow
1664SSL_R_TLSV1_ALERT_UNKNOWN_CA:1048:tlsv1 alert unknown ca
1665SSL_R_TLSV1_ALERT_UNKNOWN_PSK_IDENTITY:1115:tlsv1 alert unknown psk identity
1666SSL_R_TLSV1_ALERT_USER_CANCELLED:1090:tlsv1 alert user cancelled
1667SSL_R_TLSV1_BAD_CERTIFICATE_HASH_VALUE:1114:tlsv1 bad certificate hash value
1668SSL_R_TLSV1_BAD_CERTIFICATE_STATUS_RESPONSE:1113:\
1669	tlsv1 bad certificate status response
1670SSL_R_TLSV1_CERTIFICATE_UNOBTAINABLE:1111:tlsv1 certificate unobtainable
1671SSL_R_TLSV1_UNRECOGNIZED_NAME:1112:tlsv1 unrecognized name
1672SSL_R_TLSV1_UNSUPPORTED_EXTENSION:1110:tlsv1 unsupported extension
1673SSL_R_TLS_ILLEGAL_EXPORTER_LABEL:367:tls illegal exporter label
1674SSL_R_TLS_INVALID_ECPOINTFORMAT_LIST:157:tls invalid ecpointformat list
1675SSL_R_TOO_MANY_KEY_UPDATES:132:too many key updates
1676SSL_R_TOO_MANY_WARN_ALERTS:409:too many warn alerts
1677SSL_R_TOO_MUCH_EARLY_DATA:164:too much early data
1678SSL_R_UNABLE_TO_FIND_ECDH_PARAMETERS:314:unable to find ecdh parameters
1679SSL_R_UNABLE_TO_FIND_PUBLIC_KEY_PARAMETERS:239:\
1680	unable to find public key parameters
1681SSL_R_UNABLE_TO_LOAD_SSL3_MD5_ROUTINES:242:unable to load ssl3 md5 routines
1682SSL_R_UNABLE_TO_LOAD_SSL3_SHA1_ROUTINES:243:unable to load ssl3 sha1 routines
1683SSL_R_UNEXPECTED_CCS_MESSAGE:262:unexpected ccs message
1684SSL_R_UNEXPECTED_END_OF_EARLY_DATA:178:unexpected end of early data
1685SSL_R_UNEXPECTED_EOF_WHILE_READING:294:unexpected eof while reading
1686SSL_R_UNEXPECTED_MESSAGE:244:unexpected message
1687SSL_R_UNEXPECTED_RECORD:245:unexpected record
1688SSL_R_UNINITIALIZED:276:uninitialized
1689SSL_R_UNKNOWN_ALERT_TYPE:246:unknown alert type
1690SSL_R_UNKNOWN_CERTIFICATE_TYPE:247:unknown certificate type
1691SSL_R_UNKNOWN_CIPHER_RETURNED:248:unknown cipher returned
1692SSL_R_UNKNOWN_CIPHER_TYPE:249:unknown cipher type
1693SSL_R_UNKNOWN_CMD_NAME:386:unknown cmd name
1694SSL_R_UNKNOWN_COMMAND:139:unknown command
1695SSL_R_UNKNOWN_DIGEST:368:unknown digest
1696SSL_R_UNKNOWN_KEY_EXCHANGE_TYPE:250:unknown key exchange type
1697SSL_R_UNKNOWN_MANDATORY_PARAMETER:323:unknown mandatory parameter
1698SSL_R_UNKNOWN_PKEY_TYPE:251:unknown pkey type
1699SSL_R_UNKNOWN_PROTOCOL:252:unknown protocol
1700SSL_R_UNKNOWN_SSL_VERSION:254:unknown ssl version
1701SSL_R_UNKNOWN_STATE:255:unknown state
1702SSL_R_UNSAFE_LEGACY_RENEGOTIATION_DISABLED:338:\
1703	unsafe legacy renegotiation disabled
1704SSL_R_UNSOLICITED_EXTENSION:217:unsolicited extension
1705SSL_R_UNSUPPORTED_COMPRESSION_ALGORITHM:257:unsupported compression algorithm
1706SSL_R_UNSUPPORTED_CONFIG_VALUE:414:unsupported config value
1707SSL_R_UNSUPPORTED_CONFIG_VALUE_CLASS:415:unsupported config value class
1708SSL_R_UNSUPPORTED_CONFIG_VALUE_OP:416:unsupported config value op
1709SSL_R_UNSUPPORTED_ELLIPTIC_CURVE:315:unsupported elliptic curve
1710SSL_R_UNSUPPORTED_PROTOCOL:258:unsupported protocol
1711SSL_R_UNSUPPORTED_SSL_VERSION:259:unsupported ssl version
1712SSL_R_UNSUPPORTED_STATUS_TYPE:329:unsupported status type
1713SSL_R_UNSUPPORTED_WRITE_FLAG:412:unsupported write flag
1714SSL_R_USE_SRTP_NOT_NEGOTIATED:369:use srtp not negotiated
1715SSL_R_VERSION_TOO_HIGH:166:version too high
1716SSL_R_VERSION_TOO_LOW:396:version too low
1717SSL_R_WRONG_CERTIFICATE_TYPE:383:wrong certificate type
1718SSL_R_WRONG_CIPHER_RETURNED:261:wrong cipher returned
1719SSL_R_WRONG_CURVE:378:wrong curve
1720SSL_R_WRONG_RPK_TYPE:351:wrong rpk type
1721SSL_R_WRONG_SIGNATURE_LENGTH:264:wrong signature length
1722SSL_R_WRONG_SIGNATURE_SIZE:265:wrong signature size
1723SSL_R_WRONG_SIGNATURE_TYPE:370:wrong signature type
1724SSL_R_WRONG_SSL_VERSION:266:wrong ssl version
1725SSL_R_WRONG_VERSION_NUMBER:267:wrong version number
1726SSL_R_X509_LIB:268:x509 lib
1727SSL_R_X509_VERIFICATION_SETUP_PROBLEMS:269:x509 verification setup problems
1728TS_R_BAD_PKCS7_TYPE:132:bad pkcs7 type
1729TS_R_BAD_TYPE:133:bad type
1730TS_R_CANNOT_LOAD_CERT:137:cannot load certificate
1731TS_R_CANNOT_LOAD_KEY:138:cannot load private key
1732TS_R_CERTIFICATE_VERIFY_ERROR:100:certificate verify error
1733TS_R_COULD_NOT_SET_ENGINE:127:could not set engine
1734TS_R_COULD_NOT_SET_TIME:115:could not set time
1735TS_R_DETACHED_CONTENT:134:detached content
1736TS_R_ESS_ADD_SIGNING_CERT_ERROR:116:ess add signing cert error
1737TS_R_ESS_ADD_SIGNING_CERT_V2_ERROR:139:ess add signing cert v2 error
1738TS_R_ESS_SIGNING_CERTIFICATE_ERROR:101:ess signing certificate error
1739TS_R_INVALID_NULL_POINTER:102:invalid null pointer
1740TS_R_INVALID_SIGNER_CERTIFICATE_PURPOSE:117:invalid signer certificate purpose
1741TS_R_MESSAGE_IMPRINT_MISMATCH:103:message imprint mismatch
1742TS_R_NONCE_MISMATCH:104:nonce mismatch
1743TS_R_NONCE_NOT_RETURNED:105:nonce not returned
1744TS_R_NO_CONTENT:106:no content
1745TS_R_NO_TIME_STAMP_TOKEN:107:no time stamp token
1746TS_R_PKCS7_ADD_SIGNATURE_ERROR:118:pkcs7 add signature error
1747TS_R_PKCS7_ADD_SIGNED_ATTR_ERROR:119:pkcs7 add signed attr error
1748TS_R_PKCS7_TO_TS_TST_INFO_FAILED:129:pkcs7 to ts tst info failed
1749TS_R_POLICY_MISMATCH:108:policy mismatch
1750TS_R_PRIVATE_KEY_DOES_NOT_MATCH_CERTIFICATE:120:\
1751	private key does not match certificate
1752TS_R_RESPONSE_SETUP_ERROR:121:response setup error
1753TS_R_SIGNATURE_FAILURE:109:signature failure
1754TS_R_THERE_MUST_BE_ONE_SIGNER:110:there must be one signer
1755TS_R_TIME_SYSCALL_ERROR:122:time syscall error
1756TS_R_TOKEN_NOT_PRESENT:130:token not present
1757TS_R_TOKEN_PRESENT:131:token present
1758TS_R_TSA_NAME_MISMATCH:111:tsa name mismatch
1759TS_R_TSA_UNTRUSTED:112:tsa untrusted
1760TS_R_TST_INFO_SETUP_ERROR:123:tst info setup error
1761TS_R_TS_DATASIGN:124:ts datasign
1762TS_R_UNACCEPTABLE_POLICY:125:unacceptable policy
1763TS_R_UNSUPPORTED_MD_ALGORITHM:126:unsupported md algorithm
1764TS_R_UNSUPPORTED_VERSION:113:unsupported version
1765TS_R_VAR_BAD_VALUE:135:var bad value
1766TS_R_VAR_LOOKUP_FAILURE:136:cannot find config variable
1767TS_R_WRONG_CONTENT_TYPE:114:wrong content type
1768UI_R_COMMON_OK_AND_CANCEL_CHARACTERS:104:common ok and cancel characters
1769UI_R_INDEX_TOO_LARGE:102:index too large
1770UI_R_INDEX_TOO_SMALL:103:index too small
1771UI_R_NO_RESULT_BUFFER:105:no result buffer
1772UI_R_PROCESSING_ERROR:107:processing error
1773UI_R_RESULT_TOO_LARGE:100:result too large
1774UI_R_RESULT_TOO_SMALL:101:result too small
1775UI_R_SYSASSIGN_ERROR:109:sys$assign error
1776UI_R_SYSDASSGN_ERROR:110:sys$dassgn error
1777UI_R_SYSQIOW_ERROR:111:sys$qiow error
1778UI_R_UNKNOWN_CONTROL_COMMAND:106:unknown control command
1779UI_R_UNKNOWN_TTYGET_ERRNO_VALUE:108:unknown ttyget errno value
1780UI_R_USER_DATA_DUPLICATION_UNSUPPORTED:112:user data duplication unsupported
1781X509V3_R_BAD_IP_ADDRESS:118:bad ip address
1782X509V3_R_BAD_OBJECT:119:bad object
1783X509V3_R_BAD_OPTION:170:bad option
1784X509V3_R_BAD_VALUE:171:bad value
1785X509V3_R_BN_DEC2BN_ERROR:100:bn dec2bn error
1786X509V3_R_BN_TO_ASN1_INTEGER_ERROR:101:bn to asn1 integer error
1787X509V3_R_DIRNAME_ERROR:149:dirname error
1788X509V3_R_DISTPOINT_ALREADY_SET:160:distpoint already set
1789X509V3_R_DUPLICATE_ZONE_ID:133:duplicate zone id
1790X509V3_R_EMPTY_KEY_USAGE:169:empty key usage
1791X509V3_R_ERROR_CONVERTING_ZONE:131:error converting zone
1792X509V3_R_ERROR_CREATING_EXTENSION:144:error creating extension
1793X509V3_R_ERROR_IN_EXTENSION:128:error in extension
1794X509V3_R_EXPECTED_A_SECTION_NAME:137:expected a section name
1795X509V3_R_EXTENSION_EXISTS:145:extension exists
1796X509V3_R_EXTENSION_NAME_ERROR:115:extension name error
1797X509V3_R_EXTENSION_NOT_FOUND:102:extension not found
1798X509V3_R_EXTENSION_SETTING_NOT_SUPPORTED:103:extension setting not supported
1799X509V3_R_EXTENSION_VALUE_ERROR:116:extension value error
1800X509V3_R_ILLEGAL_EMPTY_EXTENSION:151:illegal empty extension
1801X509V3_R_INCORRECT_POLICY_SYNTAX_TAG:152:incorrect policy syntax tag
1802X509V3_R_INVALID_ASNUMBER:162:invalid asnumber
1803X509V3_R_INVALID_ASRANGE:163:invalid asrange
1804X509V3_R_INVALID_BOOLEAN_STRING:104:invalid boolean string
1805X509V3_R_INVALID_CERTIFICATE:158:invalid certificate
1806X509V3_R_INVALID_EMPTY_NAME:108:invalid empty name
1807X509V3_R_INVALID_EXTENSION_STRING:105:invalid extension string
1808X509V3_R_INVALID_INHERITANCE:165:invalid inheritance
1809X509V3_R_INVALID_IPADDRESS:166:invalid ipaddress
1810X509V3_R_INVALID_MULTIPLE_RDNS:161:invalid multiple rdns
1811X509V3_R_INVALID_NAME:106:invalid name
1812X509V3_R_INVALID_NULL_ARGUMENT:107:invalid null argument
1813X509V3_R_INVALID_NULL_VALUE:109:invalid null value
1814X509V3_R_INVALID_NUMBER:140:invalid number
1815X509V3_R_INVALID_NUMBERS:141:invalid numbers
1816X509V3_R_INVALID_OBJECT_IDENTIFIER:110:invalid object identifier
1817X509V3_R_INVALID_OPTION:138:invalid option
1818X509V3_R_INVALID_POLICY_IDENTIFIER:134:invalid policy identifier
1819X509V3_R_INVALID_PROXY_POLICY_SETTING:153:invalid proxy policy setting
1820X509V3_R_INVALID_PURPOSE:146:invalid purpose
1821X509V3_R_INVALID_SAFI:164:invalid safi
1822X509V3_R_INVALID_SECTION:135:invalid section
1823X509V3_R_INVALID_SYNTAX:143:invalid syntax
1824X509V3_R_ISSUER_DECODE_ERROR:126:issuer decode error
1825X509V3_R_MISSING_VALUE:124:missing value
1826X509V3_R_NEED_ORGANIZATION_AND_NUMBERS:142:need organization and numbers
1827X509V3_R_NEGATIVE_PATHLEN:168:negative pathlen
1828X509V3_R_NO_CONFIG_DATABASE:136:no config database
1829X509V3_R_NO_ISSUER_CERTIFICATE:121:no issuer certificate
1830X509V3_R_NO_ISSUER_DETAILS:127:no issuer details
1831X509V3_R_NO_POLICY_IDENTIFIER:139:no policy identifier
1832X509V3_R_NO_PROXY_CERT_POLICY_LANGUAGE_DEFINED:154:\
1833	no proxy cert policy language defined
1834X509V3_R_NO_PUBLIC_KEY:114:no public key
1835X509V3_R_NO_SUBJECT_DETAILS:125:no subject details
1836X509V3_R_OPERATION_NOT_DEFINED:148:operation not defined
1837X509V3_R_OTHERNAME_ERROR:147:othername error
1838X509V3_R_POLICY_LANGUAGE_ALREADY_DEFINED:155:policy language already defined
1839X509V3_R_POLICY_PATH_LENGTH:156:policy path length
1840X509V3_R_POLICY_PATH_LENGTH_ALREADY_DEFINED:157:\
1841	policy path length already defined
1842X509V3_R_POLICY_WHEN_PROXY_LANGUAGE_REQUIRES_NO_POLICY:159:\
1843	policy when proxy language requires no policy
1844X509V3_R_PURPOSE_NOT_UNIQUE:173:purpose not unique
1845X509V3_R_SECTION_NOT_FOUND:150:section not found
1846X509V3_R_UNABLE_TO_GET_ISSUER_DETAILS:122:unable to get issuer details
1847X509V3_R_UNABLE_TO_GET_ISSUER_KEYID:123:unable to get issuer keyid
1848X509V3_R_UNKNOWN_BIT_STRING_ARGUMENT:111:unknown bit string argument
1849X509V3_R_UNKNOWN_EXTENSION:129:unknown extension
1850X509V3_R_UNKNOWN_EXTENSION_NAME:130:unknown extension name
1851X509V3_R_UNKNOWN_OPTION:120:unknown option
1852X509V3_R_UNKNOWN_VALUE:172:unknown value
1853X509V3_R_UNSUPPORTED_OPTION:117:unsupported option
1854X509V3_R_UNSUPPORTED_TYPE:167:unsupported type
1855X509V3_R_USER_TOO_LONG:132:user too long
1856X509_R_AKID_MISMATCH:110:akid mismatch
1857X509_R_BAD_SELECTOR:133:bad selector
1858X509_R_BAD_X509_FILETYPE:100:bad x509 filetype
1859X509_R_BASE64_DECODE_ERROR:118:base64 decode error
1860X509_R_CANT_CHECK_DH_KEY:114:can't check dh key
1861X509_R_CERTIFICATE_VERIFICATION_FAILED:139:certificate verification failed
1862X509_R_CERT_ALREADY_IN_HASH_TABLE:101:cert already in hash table
1863X509_R_CRL_ALREADY_DELTA:127:crl already delta
1864X509_R_CRL_SIGNATURE_ALGORITHM_MISMATCH:147:crl signature algorithm mismatch
1865X509_R_CRL_VERIFY_FAILURE:131:crl verify failure
1866X509_R_DUPLICATE_ATTRIBUTE:140:duplicate attribute
1867X509_R_ERROR_GETTING_MD_BY_NID:141:error getting md by nid
1868X509_R_ERROR_USING_SIGINF_SET:142:error using siginf set
1869X509_R_IDP_MISMATCH:128:idp mismatch
1870X509_R_INVALID_ATTRIBUTES:138:invalid attributes
1871X509_R_INVALID_DIRECTORY:113:invalid directory
1872X509_R_INVALID_DISTPOINT:143:invalid distpoint
1873X509_R_INVALID_FIELD_NAME:119:invalid field name
1874X509_R_INVALID_TRUST:123:invalid trust
1875X509_R_ISSUER_MISMATCH:129:issuer mismatch
1876X509_R_KEY_TYPE_MISMATCH:115:key type mismatch
1877X509_R_KEY_VALUES_MISMATCH:116:key values mismatch
1878X509_R_LOADING_CERT_DIR:103:loading cert dir
1879X509_R_LOADING_DEFAULTS:104:loading defaults
1880X509_R_METHOD_NOT_SUPPORTED:124:method not supported
1881X509_R_NAME_TOO_LONG:134:name too long
1882X509_R_NEWER_CRL_NOT_NEWER:132:newer crl not newer
1883X509_R_NO_CERTIFICATE_FOUND:135:no certificate found
1884X509_R_NO_CERTIFICATE_OR_CRL_FOUND:136:no certificate or crl found
1885X509_R_NO_CERT_SET_FOR_US_TO_VERIFY:105:no cert set for us to verify
1886X509_R_NO_CRL_FOUND:137:no crl found
1887X509_R_NO_CRL_NUMBER:130:no crl number
1888X509_R_PUBLIC_KEY_DECODE_ERROR:125:public key decode error
1889X509_R_PUBLIC_KEY_ENCODE_ERROR:126:public key encode error
1890X509_R_SHOULD_RETRY:106:should retry
1891X509_R_UNABLE_TO_FIND_PARAMETERS_IN_CHAIN:107:unable to find parameters in chain
1892X509_R_UNABLE_TO_GET_CERTS_PUBLIC_KEY:108:unable to get certs public key
1893X509_R_UNKNOWN_KEY_TYPE:117:unknown key type
1894X509_R_UNKNOWN_NID:109:unknown nid
1895X509_R_UNKNOWN_PURPOSE_ID:121:unknown purpose id
1896X509_R_UNKNOWN_SIGID_ALGS:144:unknown sigid algs
1897X509_R_UNKNOWN_TRUST_ID:120:unknown trust id
1898X509_R_UNSUPPORTED_ALGORITHM:111:unsupported algorithm
1899X509_R_UNSUPPORTED_VERSION:145:unsupported version
1900X509_R_WRONG_LOOKUP_TYPE:112:wrong lookup type
1901X509_R_WRONG_TYPE:122:wrong type
1902